program: Orca
programVersion: 5.0.2
elementType: S O O N N C C C C C C C C C C C C C C C C H H H H H H H H H H H H H H
charge: 0
multiplicity: 1
keywords: wb97x-d3
keywords: def2-TZVPP
keywords: def2/J RIJCOSX
keywords: DEFGRID2
keywords: scfconv7
keywords: smallprint printgap noloewdin
keywords: NOSOSCF
formula: C16H14N2O2S
InChI: InChI=1/C16H14N2O2S/c1-18(12-7-3-2-4-8-12)15(19)11-20-16-17-13-9-5-6-10-14(13)21-16/h2-10H,11H2,1H3
35 atoms
S  1.831876 2.824359 0.9891
O  -0.644893 2.308596 0.362043
O  -1.076673 -0.129078 1.289141
N  -2.571269 -0.690112 -0.32156
N  0.992792 1.140451 -0.801073
C  -2.6392 -2.040477 0.119406
C  -1.73354 0.164231 0.302393
C  -1.656229 1.562871 -0.291413
C  3.021137 1.932824 0.083655
C  2.370323 1.082952 -0.824299
C  -3.234976 -0.347272 -1.574305
C  -3.111286 -2.34794 1.390108
C  -2.252675 -3.060249 -0.742341
C  0.602877 1.984509 0.077919
C  4.403326 1.987175 0.17912
C  3.130759 0.267433 -1.65691
C  -3.181818 -3.671702 1.7983
C  -2.337206 -4.383397 -0.332535
C  5.143036 1.166974 -0.657858
C  4.510961 0.316746 -1.566577
C  -2.795515 -4.692717 0.940117
H  -1.488249 1.544118 -1.369519
H  -2.588579 2.098759 -0.105459
H  -3.714609 0.627854 -1.50942
H  -4.019974 -1.073027 -1.764535
H  -2.548382 -0.350371 -2.421486
H  -3.435323 -1.55941 2.056344
H  -1.885346 -2.824269 -1.733313
H  4.894256 2.645663 0.88321
H  2.642102 -0.392661 -2.361424
H  -3.549025 -3.904511 2.78913
H  -2.035842 -5.171956 -1.009291
H  6.223101 1.188644 -0.60389
H  5.109088 -0.314409 -2.210289
H  -2.856699 -5.72427 1.260583
elementType: S O N C H
totalener: -1276.38360714 hartree
nucrepener: 1697.67145347 hartree
electener: -2974.05506062 hartree
oneelecener: -5117.55674498 hartree
twoeener: 2143.50168437 hartree
cpcmener: -0.04219081 hartree
kineticenergy: 1271.97939475 hartree
xcener: -104.130559476629 hartree
chargesum: -0.0000000
charge: 0.058169 -0.290915 -0.534575 -0.089207 -0.341318 0.160456 0.324763 0.017785 -0.056007 0.152356 -0.205622 -0.259070 -0.212375 0.295940 -0.158324 -0.247198 -0.118399 -0.123607 -0.162180 -0.131054 -0.167633 0.133851 0.161660 0.122132 0.122867 0.133715 0.155015 0.156040 0.152097 0.145970 0.160609 0.161291 0.161397 0.159021 0.162351
qa: 0.0582 -0.2909 -0.5346 -0.0892 -0.3413 0.1605 0.3248 0.0178 -0.0560 0.1524 -0.2056 -0.2591 -0.2124 0.2959 -0.1583 -0.2472 -0.1184 -0.1236 -0.1622 -0.1311 -0.1676 0.1339 0.1617 0.1221 0.1229 0.1337 0.1550 0.1560 0.1521 0.1460 0.1606 0.1613 0.1614 0.1590 0.1624
va: 2.6186 2.1230 1.9654 3.1421 2.9976 3.6043 4.0585 3.8237 3.8630 3.8570 3.8956 4.0348 3.9876 4.1106 3.8826 4.0106 3.8833 3.8807 3.8970 3.8868 3.8966 1.0085 0.9902 0.9916 0.9952 0.9813 1.0069 1.0007 0.9991 1.0105 0.9903 0.9906 0.9882 0.9892 0.9891
dispcorr: -0.014683943 hartree
energy: -1276.398291084734
dipole: -8.88454 7.47432 -1.41022 -12.32408 12.20999 -0.11409 -7.65952 5.78925 -1.87026
magnitude: 2.34513 au
magnitude: 5.96085 debye
