program: Orca
programVersion: 5.0.2
elementType: S O O N N C C C C C C C C C C C C C C C C H H H H H H H H H H H H H H
charge: 0
multiplicity: 1
keywords: wb97x-d3
keywords: def2-TZVPP
keywords: def2/J RIJCOSX
keywords: DEFGRID2
keywords: scfconv7
keywords: smallprint printgap noloewdin
keywords: NOSOSCF
formula: C16H14N2O2S
InChI: InChI=1/C16H14N2O2S/c1-18(12-7-3-2-4-8-12)15(19)11-20-16-17-13-9-5-6-10-14(13)21-16/h2-10H,11H2,1H3
35 atoms
S  1.664423 0.677474 1.436763
O  -0.81515 1.375277 1.059678
O  -2.964406 1.425384 -1.786225
N  -2.332024 -0.459729 -0.747163
N  0.512371 1.198055 -0.833379
C  -1.777762 -1.162735 0.355557
C  -2.421344 0.880139 -0.832005
C  -1.921972 1.797907 0.276474
C  2.608974 0.518918 -0.014886
C  1.813256 0.842068 -1.125684
C  -2.785554 -1.23663 -1.896664
C  -0.642645 -1.942678 0.16333
C  -2.378999 -1.105046 1.606288
C  0.315816 1.134645 0.429537
C  3.935545 0.137564 -0.146245
C  2.366764 0.777314 -2.400702
C  -0.10511 -2.653348 1.22543
C  -1.82371 -1.801146 2.670292
C  4.468757 0.079901 -1.423844
C  3.690451 0.396664 -2.538354
C  -0.688913 -2.578632 2.482581
H  -1.699442 2.758352 -0.190534
H  -2.733314 1.951597 0.988675
H  -2.641656 -2.291282 -1.686604
H  -2.224439 -0.985108 -2.795812
H  -3.845577 -1.073291 -2.08701
H  -0.177554 -1.990344 -0.813417
H  -3.273306 -0.511798 1.749985
H  4.538857 -0.110729 0.71682
H  1.764495 1.021706 -3.265651
H  0.779716 -3.256533 1.07123
H  -2.288294 -1.744538 3.645793
H  5.500464 -0.21704 -1.5555
H  4.128005 0.341199 -3.526135
H  -0.263917 -3.12785 3.312213
elementType: S O N C H
totalener: -1276.37994470 hartree
nucrepener: 1822.65702411 hartree
electener: -3099.03696882 hartree
oneelecener: -5366.36527069 hartree
twoeener: 2267.32830188 hartree
cpcmener: -0.03391538 hartree
kineticenergy: 1271.99120562 hartree
xcener: -104.134118972288 hartree
chargesum: 0.0000000
charge: 0.050995 -0.287310 -0.547916 -0.048975 -0.320410 0.089177 0.302704 0.026270 -0.040784 0.145134 -0.170166 -0.163041 -0.231321 0.306069 -0.156197 -0.255489 -0.178002 -0.131882 -0.163042 -0.128634 -0.136915 0.127379 0.153157 0.113177 0.118884 0.113148 0.159032 0.154764 0.152412 0.145964 0.158308 0.160109 0.161685 0.159463 0.162253
qa: 0.0510 -0.2873 -0.5479 -0.0490 -0.3204 0.0892 0.3027 0.0263 -0.0408 0.1451 -0.1702 -0.1630 -0.2313 0.3061 -0.1562 -0.2555 -0.1780 -0.1319 -0.1630 -0.1286 -0.1369 0.1274 0.1532 0.1132 0.1189 0.1131 0.1590 0.1548 0.1524 0.1460 0.1583 0.1601 0.1617 0.1595 0.1623
va: 2.6040 2.0961 1.9633 3.1030 3.0163 3.5702 4.1004 3.7900 3.8384 3.8183 3.8819 3.8810 3.9936 4.1132 3.8805 4.0177 3.9011 3.8969 3.8978 3.8827 3.8645 1.0294 0.9885 0.9992 0.9912 0.9956 1.0007 1.0011 0.9988 1.0108 0.9929 0.9905 0.9879 0.9891 0.9877
dispcorr: -0.019602944 hartree
energy: -1276.399547647025
dipole: -3.31782 4.19492 0.87710 -8.48519 6.89610 -1.58909 -3.94907 5.33336 1.38429
magnitude: 2.28271 au
magnitude: 5.80218 debye
