program: Orca
programVersion: 5.0.2
elementType: S O O N N C C C C C C C C C C C C C C C C H H H H H H H H H H H H H H
charge: 0
multiplicity: 1
keywords: wb97x-d3
keywords: def2-TZVPP
keywords: def2/J RIJCOSX
keywords: DEFGRID2
keywords: scfconv7
keywords: smallprint printgap noloewdin
keywords: NOSOSCF
formula: C16H14N2O2S
InChI: InChI=1/C16H14N2O2S/c1-18(12-7-3-2-4-8-12)15(19)11-20-16-17-13-9-5-6-10-14(13)21-16/h2-10H,11H2,1H3
35 atoms
S  1.685205 3.020463 0.77397
O  -0.818085 2.425768 0.304217
O  -1.318345 0.072128 1.446618
N  -2.472503 -0.730708 -0.325022
N  0.777908 1.076141 -0.687299
C  -2.388712 -2.068017 0.152667
C  -1.84003 0.24528 0.359792
C  -1.824796 1.623109 -0.291333
C  2.83842 1.969145 0.000138
C  2.151694 0.99018 -0.734978
C  -3.10334 -0.510824 -1.618972
C  -3.541872 -2.739683 0.53613
C  -1.15863 -2.712672 0.20476
C  0.421221 2.058185 0.05058
C  4.223297 2.011465 0.047126
C  2.873679 0.027633 -1.433787
C  -3.465754 -4.057425 0.964835
C  -1.086108 -4.025498 0.645011
C  4.925243 1.045498 -0.656133
C  4.255925 0.062911 -1.387192
C  -2.238264 -4.70174 1.023571
H  -1.675138 1.576856 -1.371101
H  -2.767461 2.138427 -0.098342
H  -3.66002 0.423621 -1.639123
H  -3.816344 -1.308098 -1.807104
H  -2.37261 -0.511738 -2.42977
H  -4.498643 -2.233586 0.498874
H  -0.260386 -2.193375 -0.105146
H  4.74741 2.769866 0.613369
H  2.350429 -0.732309 -1.999547
H  -4.367961 -4.576909 1.260443
H  -0.126027 -4.523128 0.685878
H  6.006764 1.055737 -0.635081
H  4.826202 -0.682375 -1.92601
H  -2.178544 -5.728117 1.361321
elementType: S O N C H
totalener: -1276.38822149 hartree
nucrepener: 1717.64238378 hartree
electener: -2994.03060527 hartree
oneelecener: -5157.17545928 hartree
twoeener: 2163.14485401 hartree
cpcmener: -0.03369326 hartree
kineticenergy: 1272.00054207 hartree
xcener: -104.132416752265 hartree
chargesum: -0.0000000
charge: 0.055302 -0.282889 -0.495373 -0.091600 -0.340399 0.172542 0.284031 0.011293 -0.070530 0.178760 -0.180387 -0.228882 -0.246255 0.300391 -0.147553 -0.257769 -0.115495 -0.116877 -0.165861 -0.121204 -0.159992 0.132164 0.151357 0.120510 0.113123 0.125388 0.151745 0.149248 0.148382 0.141753 0.156894 0.156341 0.157391 0.156138 0.158313
qa: 0.0553 -0.2829 -0.4954 -0.0916 -0.3404 0.1725 0.2840 0.0113 -0.0705 0.1788 -0.1804 -0.2289 -0.2463 0.3004 -0.1476 -0.2578 -0.1155 -0.1169 -0.1659 -0.1212 -0.1600 0.1322 0.1514 0.1205 0.1131 0.1254 0.1517 0.1492 0.1484 0.1418 0.1569 0.1563 0.1574 0.1561 0.1583
va: 2.6155 2.1333 2.0136 3.0930 2.9772 3.5797 4.1035 3.8401 3.8934 3.8240 3.8888 4.0185 4.0463 4.1164 3.8839 4.0105 3.8818 3.8882 3.9082 3.8844 3.9009 1.0039 0.9900 0.9882 0.9975 0.9884 1.0030 1.0081 0.9995 1.0118 0.9915 0.9919 0.9896 0.9901 0.9902
dispcorr: -0.015438598 hartree
energy: -1276.403660091847
dipole: -7.43427 6.42248 -1.01179 -13.56509 13.20840 -0.35669 -7.35836 5.43704 -1.92132
magnitude: 2.20055 au
magnitude: 5.59335 debye
