program: Orca
programVersion: 5.0.2
elementType: S O O N N C C C C C C C C C C C C C C C C H H H H H H H H H H H H H H
charge: 0
multiplicity: 1
keywords: wb97x-d3
keywords: def2-TZVPP
keywords: def2/J RIJCOSX
keywords: DEFGRID2
keywords: scfconv7
keywords: smallprint printgap noloewdin
keywords: NOSOSCF
formula: C16H14N2O2S
InChI: InChI=1/C16H14N2O2S/c1-18(12-7-3-2-4-8-12)15(19)11-20-16-17-13-9-5-6-10-14(13)21-16/h2-10H,11H2,1H3
35 atoms
S  1.623403 2.851454 -0.864486
O  -0.738797 1.783525 -1.233212
O  -2.151806 1.60283 1.057791
N  -2.382906 -0.625918 0.851964
N  0.806342 0.520335 -0.066167
C  -2.166127 -1.822312 0.116776
C  -2.076715 0.596076 0.373365
C  -1.660737 0.708967 -1.0888
C  2.74633 1.841404 0.003826
C  2.116184 0.633825 0.344607
C  -2.750042 -0.740405 2.256728
C  -1.108646 -2.654724 0.466326
C  -3.015933 -2.175443 -0.923287
C  0.443419 1.575432 -0.691912
C  4.065532 2.10137 0.342544
C  2.830178 -0.335209 1.04292
C  -0.895698 -3.831501 -0.234582
C  -2.787769 -3.346542 -1.633284
C  4.760381 1.123773 1.036934
C  4.147555 -0.081713 1.382127
C  -1.730794 -4.176899 -1.289257
H  -1.233182 -0.204575 -1.499834
H  -2.528337 0.984418 -1.689707
H  -1.905045 -0.534632 2.91539
H  -3.100933 -1.750619 2.447288
H  -3.556647 -0.051177 2.502175
H  -0.450024 -2.377073 1.279915
H  -3.849931 -1.533559 -1.179132
H  4.543862 3.034319 0.074342
H  2.354176 -1.270085 1.309594
H  -0.069571 -4.475515 0.037832
H  -3.445764 -3.613905 -2.449859
H  5.791856 1.299778 1.31225
H  4.711527 -0.83013 1.923307
H  -1.55836 -5.092293 -1.840278
elementType: S O N C H
totalener: -1276.38940008 hartree
nucrepener: 1745.45134620 hartree
electener: -3021.84074628 hartree
oneelecener: -5212.29480156 hartree
twoeener: 2190.45405528 hartree
cpcmener: -0.02938095 hartree
kineticenergy: 1271.99337642 hartree
xcener: -104.130252381946 hartree
chargesum: -0.0000000
charge: 0.053398 -0.284380 -0.509435 -0.066971 -0.345681 0.097662 0.289838 0.033744 -0.065934 0.178148 -0.172924 -0.231385 -0.218738 0.305656 -0.156879 -0.247879 -0.118409 -0.108907 -0.162722 -0.128115 -0.152822 0.129471 0.146991 0.120109 0.116250 0.110086 0.151841 0.155455 0.148400 0.146204 0.157474 0.157461 0.157268 0.156457 0.159269
qa: 0.0534 -0.2844 -0.5094 -0.0670 -0.3457 0.0977 0.2898 0.0337 -0.0659 0.1781 -0.1729 -0.2314 -0.2187 0.3057 -0.1569 -0.2479 -0.1184 -0.1089 -0.1627 -0.1281 -0.1528 0.1295 0.1470 0.1201 0.1162 0.1101 0.1518 0.1555 0.1484 0.1462 0.1575 0.1575 0.1573 0.1565 0.1593
va: 2.6135 2.1357 2.0098 3.0776 2.9985 3.5805 4.0960 3.8640 3.9075 3.8306 3.8869 4.0042 4.0214 4.1231 3.8975 3.9848 3.8947 3.8806 3.9049 3.8935 3.9062 1.0045 0.9915 0.9890 0.9966 1.0005 1.0052 1.0027 0.9992 1.0075 0.9917 0.9913 0.9893 0.9905 0.9898
dispcorr: -0.016679055 hartree
energy: -1276.406079134929
dipole: -4.76470 4.81360 0.04890 -15.45297 13.27164 -2.18134 4.68701 -5.28154 -0.59453
magnitude: 2.26143 au
magnitude: 5.74811 debye
