program: Orca
programVersion: 5.0.2
elementType: S O O N N C C C C C C C C C C C C C C C C H H H H H H H H H H H H H H
charge: 0
multiplicity: 1
keywords: wb97x-d3
keywords: def2-TZVPP
keywords: def2/J RIJCOSX
keywords: DEFGRID2
keywords: scfconv7
keywords: smallprint printgap noloewdin
keywords: NOSOSCF
formula: C16H14N2O2S
InChI: InChI=1/C16H14N2O2S/c1-18(12-7-3-2-4-8-12)15(19)11-20-16-17-13-9-5-6-10-14(13)21-16/h2-10H,11H2,1H3
35 atoms
S  1.63708 0.672292 1.522141
O  -0.867263 1.237136 1.052413
O  -2.758401 1.400722 -1.95166
N  -2.195652 -0.514634 -0.922991
N  0.553655 1.217363 -0.773837
C  -1.832062 -1.246386 0.237308
C  -2.312592 0.827916 -0.969317
C  -1.936844 1.687643 0.231539
C  2.654518 0.647637 0.11015
C  1.886415 0.967797 -1.021293
C  -2.495129 -1.256049 -2.141593
C  -0.664177 -2.001317 0.231798
C  -2.649904 -1.240705 1.360381
C  0.305154 1.089827 0.473881
C  4.008602 0.36308 0.020514
C  2.495162 1.002569 -2.272158
C  -0.310524 -2.735203 1.353783
C  -2.281847 -1.962773 2.486795
C  4.597082 0.402862 -1.233564
C  3.846655 0.719918 -2.366932
C  -1.113004 -2.711604 2.486553
H  -1.713256 2.684246 -0.15334
H  -2.795879 1.769575 0.898156
H  -1.858102 -0.937586 -2.966615
H  -3.53739 -1.129238 -2.436039
H  -2.322067 -2.313087 -1.963124
H  -0.03054 -2.010611 -0.646669
H  -3.572758 -0.673667 1.355493
H  4.592426 0.114898 0.897243
H  1.911194 1.247155 -3.150014
H  0.601644 -3.31761 1.345276
H  -2.917585 -1.94778 3.362642
H  5.652024 0.18345 -1.331851
H  4.328756 0.742326 -3.335484
H  -0.830082 -3.277967 3.364336
elementType: S O N C H
totalener: -1276.38698247 hartree
nucrepener: 1812.53077538 hartree
electener: -3088.91775785 hartree
oneelecener: -5346.06568965 hartree
twoeener: 2257.14793180 hartree
cpcmener: -0.02825964 hartree
kineticenergy: 1271.99157442 hartree
xcener: -104.132076485141 hartree
chargesum: 0.0000000
charge: 0.049656 -0.281899 -0.507302 -0.049399 -0.315231 0.093544 0.281420 0.022993 -0.048805 0.150961 -0.166468 -0.191186 -0.235803 0.302642 -0.154494 -0.252221 -0.152195 -0.125427 -0.161510 -0.123976 -0.138618 0.126363 0.147513 0.116215 0.112496 0.110006 0.157750 0.153282 0.149188 0.145043 0.156315 0.156770 0.157559 0.155700 0.159120
qa: 0.0497 -0.2819 -0.5073 -0.0494 -0.3152 0.0935 0.2814 0.0230 -0.0488 0.1510 -0.1665 -0.1912 -0.2358 0.3026 -0.1545 -0.2522 -0.1522 -0.1254 -0.1615 -0.1240 -0.1386 0.1264 0.1475 0.1162 0.1125 0.1100 0.1577 0.1533 0.1492 0.1450 0.1563 0.1568 0.1576 0.1557 0.1591
va: 2.6033 2.1002 2.0152 3.0683 3.0092 3.5832 4.1255 3.7899 3.8589 3.8314 3.8844 3.9119 4.0073 4.1048 3.8866 4.0176 3.8981 3.9066 3.9055 3.8874 3.8848 1.0297 0.9886 0.9926 0.9956 0.9995 1.0027 1.0014 0.9995 1.0111 0.9928 0.9918 0.9894 0.9904 0.9890
dispcorr: -0.019157747 hartree
energy: -1276.406140217246
dipole: -3.30167 3.98642 0.68475 -8.26200 6.78966 -1.47234 -4.25440 5.56757 1.31317
magnitude: 2.08832 au
magnitude: 5.30809 debye
