program: Orca
programVersion: 5.0.2
elementType: S O O N N C C C C C C C C C C C C C C C C H H H H H H H H H H H H H H
charge: 0
multiplicity: 1
keywords: wb97x-d3
keywords: def2-TZVPP
keywords: def2/J RIJCOSX
keywords: DEFGRID2
keywords: scfconv7
keywords: smallprint printgap noloewdin
keywords: NOSOSCF
formula: C16H14N2O2S
InChI: InChI=1/C16H14N2O2S/c1-18(12-7-3-2-4-8-12)15(19)11-20-16-17-13-9-5-6-10-14(13)21-16/h2-10H,11H2,1H3
35 atoms
S  1.57152 2.939075 -0.690917
O  -0.81141 1.87555 -0.898434
O  -1.768951 1.398384 1.568179
N  -2.219203 -0.758319 1.108326
N  0.880292 0.501561 -0.125839
C  -2.246386 -1.835565 0.181265
C  -1.892301 0.499447 0.753355
C  -1.713476 0.788787 -0.733177
C  2.801132 1.852037 -0.107433
C  2.228608 0.594023 0.138962
C  -2.362254 -1.061665 2.524544
C  -3.319011 -1.984374 -0.687894
C  -1.203084 -2.754855 0.167676
C  0.433521 1.622017 -0.552049
C  4.146844 2.101773 0.113975
C  3.029279 -0.437875 0.618627
C  -3.334719 -3.039408 -1.590028
C  -1.23165 -3.815378 -0.724789
C  4.92786 1.062378 0.594019
C  4.372908 -0.19396 0.842681
C  -2.29392 -3.956528 -1.608529
H  -1.37142 -0.070765 -1.308721
H  -2.661296 1.127782 -1.153047
H  -2.740535 -2.074398 2.630526
H  -3.072361 -0.384025 2.995738
H  -1.410359 -0.988507 3.051259
H  -4.13656 -1.274498 -0.661039
H  -0.368205 -2.632956 0.846907
H  4.579108 3.075108 -0.077902
H  2.596769 -1.411507 0.811009
H  -4.167104 -3.147714 -2.273105
H  -0.417125 -4.528022 -0.736349
H  5.980778 1.230546 0.777687
H  5.003076 -0.989706 1.217665
H  -2.310083 -4.781247 -2.309184
elementType: S O N C H
totalener: -1276.38974237 hartree
nucrepener: 1739.79841523 hartree
electener: -3016.18815760 hartree
oneelecener: -5201.04595482 hartree
twoeener: 2184.85779722 hartree
cpcmener: -0.02939139 hartree
kineticenergy: 1271.99722633 hartree
xcener: -104.130779577052 hartree
chargesum: -0.0000000
charge: 0.053891 -0.284688 -0.508209 -0.066377 -0.344527 0.070241 0.289871 0.030046 -0.062937 0.174585 -0.170601 -0.208301 -0.216859 0.303660 -0.157313 -0.248588 -0.112607 -0.122055 -0.163212 -0.126499 -0.146811 0.132202 0.148232 0.115485 0.111083 0.119879 0.156114 0.151188 0.148541 0.146576 0.157589 0.157319 0.156781 0.156862 0.159441
qa: 0.0539 -0.2847 -0.5082 -0.0664 -0.3445 0.0702 0.2899 0.0300 -0.0629 0.1746 -0.1706 -0.2083 -0.2169 0.3037 -0.1573 -0.2486 -0.1126 -0.1221 -0.1632 -0.1265 -0.1468 0.1322 0.1482 0.1155 0.1111 0.1199 0.1561 0.1512 0.1485 0.1466 0.1576 0.1573 0.1568 0.1569 0.1594
va: 2.6143 2.1351 2.0111 3.0716 2.9949 3.5954 4.0966 3.8590 3.9011 3.8328 3.8849 4.0236 4.0084 4.1212 3.8959 3.9914 3.8888 3.8953 3.9051 3.8902 3.9011 1.0022 0.9912 0.9969 0.9995 0.9895 1.0029 1.0067 0.9993 1.0076 0.9915 0.9920 0.9896 0.9903 0.9898
dispcorr: -0.016475124 hartree
energy: -1276.406217494583
dipole: -4.92354 4.65745 -0.26609 -15.81099 13.74445 -2.06654 3.37576 -4.22563 -0.84987
magnitude: 2.25026 au
magnitude: 5.71970 debye
