program: Orca
programVersion: 5.0.2
elementType: S O O N N C C C C C C C C C C C C C C C C H H H H H H H H H H H H H H
charge: 0
multiplicity: 1
keywords: wb97x-d3
keywords: def2-TZVPP
keywords: def2/J RIJCOSX
keywords: DEFGRID2
keywords: scfconv7
keywords: smallprint printgap noloewdin
keywords: NOSOSCF
formula: C16H14N2O2S
InChI: InChI=1/C16H14N2O2S/c1-18(12-7-3-2-4-8-12)15(19)11-20-16-17-13-9-5-6-10-14(13)21-16/h2-10H,11H2,1H3
35 atoms
S  1.649452 -0.602943 -1.485402
O  -0.840278 0.143487 -1.756623
O  -3.017659 2.280158 0.105023
N  -2.338309 0.259588 0.81285
N  0.46983 1.400316 -0.326298
C  -1.819701 -1.036605 0.582198
C  -2.453994 1.233508 -0.127307
C  -1.927025 1.030714 -1.547962
C  2.575723 0.362348 -0.374196
C  1.76468 1.387887 0.139615
C  -2.76795 0.60607 2.160039
C  -0.660959 -1.441566 1.235965
C  -2.477781 -1.921733 -0.261991
C  0.28827 0.437707 -1.145563
C  3.899838 0.21762 0.009658
C  2.299244 2.283659 1.059535
C  -0.160062 -2.71744 1.035323
C  -1.960822 -3.189657 -0.477633
C  4.413353 1.11775 0.927959
C  3.619194 2.140399 1.446347
C  -0.803104 -3.591725 0.171602
H  -2.732494 0.637443 -2.169357
H  -1.67493 2.028984 -1.909954
H  -2.626369 -0.257861 2.803606
H  -3.82192 0.883476 2.176412
H  -2.191718 1.442387 2.556472
H  -0.144783 -0.747848 1.887644
H  -3.396716 -1.617025 -0.747124
H  4.517043 -0.574124 -0.393386
H  1.678459 3.07594 1.455064
H  0.746055 -3.021319 1.542101
H  -2.472473 -3.8703 -1.145103
H  5.443422 1.02542 1.244653
H  4.04305 2.832421 2.161464
H  -0.405027 -4.583912 0.006643
totalener: -1276.36197144 hartree
nucrepener: 1823.91426233 hartree
electener: -3100.27623376 hartree
oneelecener: -5368.14148593 hartree
twoeener: 2267.86525217 hartree
kineticenergy: 1272.03718988 hartree
xcener: -104.136319690570 hartree
chargesum: 0.0000000
charge: 0.047582 -0.263893 -0.388464 -0.072605 -0.281598 0.050242 0.255292 -0.006652 -0.035288 0.110528 -0.170709 -0.162018 -0.182123 0.291978 -0.133281 -0.218882 -0.143016 -0.102659 -0.129454 -0.089104 -0.096012 0.119672 0.129009 0.098488 0.112017 0.116349 0.145937 0.122942 0.118521 0.129484 0.126753 0.125365 0.123831 0.124408 0.127358
qa: 0.0476 -0.2639 -0.3885 -0.0726 -0.2816 0.0502 0.2553 -0.0067 -0.0353 0.1105 -0.1707 -0.1620 -0.1821 0.2920 -0.1333 -0.2189 -0.1430 -0.1027 -0.1295 -0.0891 -0.0960 0.1197 0.1290 0.0985 0.1120 0.1163 0.1459 0.1229 0.1185 0.1295 0.1268 0.1254 0.1238 0.1244 0.1274
va: 2.5999 2.1054 2.1409 3.0602 3.0095 3.6898 4.1411 3.8360 3.8775 3.9271 3.9023 3.9286 4.0500 4.1019 3.9347 4.0408 3.9663 3.9770 3.9675 3.9277 3.9319 0.9923 1.0285 0.9980 0.9997 0.9930 1.0043 1.0095 1.0077 1.0156 1.0030 1.0015 1.0002 1.0000 0.9989
dispcorr: -0.019663742 hartree
energy: -1276.381635178460
dipole: -3.31430 3.90479 0.59049 -2.64279 1.33203 -1.31076 8.88866 -8.73107 0.15758
magnitude: 1.44624 au
magnitude: 3.67604 debye
