program: Orca
programVersion: 5.0.2
elementType: Cl Cl F F O O N N N N C C C C C C C C C C C C C C C C C C H H H H H H H H H H H H H H
charge: 0
multiplicity: 1
keywords: wb97x-d3
keywords: def2-TZVPP
keywords: def2/J RIJCOSX
keywords: DEFGRID2
keywords: scfconv7
keywords: smallprint printgap noloewdin
keywords: NOSOSCF
formula: C18H14Cl2F2N4O2
InChI: InChI=1/C18H14Cl2F2N4O2/c1-10(2)25(16-6-4-12(21)8-14(16)22)17(27)24-9-23-26(18(24)28)15-5-3-11(19)7-13(15)20/h3-10H,1-2H3
42 atoms
Cl -1.543611 1.570424 0.051844
Cl -6.609549 -0.007329 -0.685054
F  2.715271 0.225719 2.148211
F  1.168403 4.322276 0.518217
O  2.956587 -2.984913 0.101282
O  0.09942 -0.807456 -1.485862
N  3.107522 -0.760751 -0.37266
N  1.121544 -1.683374 0.433157
N  -0.991606 -1.335759 0.50099
N  -0.665714 -1.937357 1.681906
C  4.504636 -0.869986 -0.860294
C  2.552251 0.525665 -0.168486
C  2.477128 -1.877575 0.03146
C  5.367455 0.260722 -0.326049
C  4.551865 -0.964492 -2.376903
C  0.075745 -1.203164 -0.343149
C  2.394949 1.017225 1.120743
C  2.218575 1.358702 -1.227426
C  0.594117 -2.147189 1.61033
C  -2.324571 -1.013664 0.203666
C  1.918216 2.284754 1.38194
C  1.759987 2.646835 -1.007807
C  1.617845 3.082834 0.294825
C  -2.703896 0.303083 -0.040742
C  -3.286891 -2.01266 0.17686
C  -4.022017 0.618046 -0.327752
C  -4.611227 -1.713875 -0.08546
C  -4.962729 -0.398127 -0.344103
H  4.891174 -1.79987 -0.445546
H  6.403889 0.065301 -0.602314
H  5.097809 1.232145 -0.7416
H  5.327168 0.323656 0.762033
H  5.571699 -1.179862 -2.698365
H  4.246826 -0.032906 -2.855047
H  3.911761 -1.766465 -2.746072
H  2.319707 0.996521 -2.240414
H  1.187143 -2.607075 2.384575
H  1.798642 2.638624 2.397976
H  1.507312 3.293618 -1.836801
H  -2.993889 -3.03664 0.368117
H  -4.308522 1.642897 -0.519111
H  -5.352741 -2.500444 -0.098222
elementType: Cl F O N C H
totalener: -2184.07249337 hartree
nucrepener: 3079.37879011 hartree
electener: -5263.45128348 hartree
oneelecener: -9124.48405760 hartree
twoeener: 3861.03277411 hartree
cpcmener: -0.03175868 hartree
kineticenergy: 2177.77244020 hartree
xcener: -159.375997730081 hartree
chargesum: -0.0000000
charge: -0.064107 -0.073986 -0.211615 -0.209784 -0.447024 -0.469416 -0.003277 -0.110806 0.029728 -0.291315 0.071031 -0.102671 0.361378 -0.267229 -0.270484 0.344098 0.285918 -0.176544 0.100885 0.154325 -0.185057 -0.163664 0.293923 -0.045160 -0.203405 -0.059819 -0.085258 0.056388 0.070889 0.108327 0.099143 0.103302 0.103332 0.086270 0.101488 0.159087 0.181372 0.145387 0.151655 0.153176 0.131834 0.147685
qa: -0.0641 -0.0740 -0.2116 -0.2098 -0.4470 -0.4694 -0.0033 -0.1108 0.0297 -0.2913 0.0710 -0.1027 0.3614 -0.2672 -0.2705 0.3441 0.2859 -0.1765 0.1009 0.1543 -0.1851 -0.1637 0.2939 -0.0452 -0.2034 -0.0598 -0.0853 0.0564 0.0709 0.1083 0.0991 0.1033 0.1033 0.0863 0.1015 0.1591 0.1814 0.1454 0.1517 0.1532 0.1318 0.1477
va: 1.2715 1.2279 1.0785 1.0703 2.0727 2.0496 3.0698 3.1942 3.1769 2.9127 3.8204 3.6220 4.2870 3.9222 3.9403 4.3395 3.8997 3.8878 4.0344 3.6110 3.8950 3.8821 3.8495 4.0572 4.0647 3.9588 3.9494 3.9034 1.0306 1.0041 0.9992 1.0071 1.0058 1.0040 1.0070 1.0066 0.9923 1.0073 0.9985 1.0076 1.0153 1.0027
dispcorr: -0.027697517 hartree
energy: -2184.100190886531
dipole: 35.24176 -34.21518 1.02658 -8.90193 9.45911 0.55718 -9.97242 10.19056 0.21814
magnitude: 1.18823 au
magnitude: 3.02025 debye
