program: Orca
programVersion: 5.0.2
elementType: Cl O O O C C C C C C C C C C C C C C C C C C C C H H H H H H H H H H H H H H H H H
charge: 0
multiplicity: 1
keywords: wb97x-d3
keywords: def2-TZVPP
keywords: def2/J RIJCOSX
keywords: DEFGRID2
keywords: scfconv7
keywords: smallprint printgap noloewdin
keywords: NOSOSCF
formula: C20H17ClO3
InChI: InChI=1/C20H17ClO3/c1-2-19(17(22)15-8-3-4-9-16(15)18(19)23)11-20(12-24-20)13-6-5-7-14(21)10-13/h3-10H,2,11-12H2,1H3
41 atoms
Cl -3.61127 -0.863715 0.024227
O  0.460595 3.732641 0.368408
O  1.440308 0.197415 2.655889
O  1.469783 -0.470115 -2.000303
C  0.480067 2.31389 0.298467
C  1.865552 1.735989 0.08388
C  1.990789 0.222663 0.282986
C  0.156096 2.994572 1.547602
C  3.487232 -0.187173 0.389598
C  -0.61319 1.704982 -0.519263
C  1.317641 -0.286956 1.554309
C  1.336385 -0.619829 -0.807751
C  0.515012 -1.474458 1.214058
C  0.530022 -1.671636 -0.160699
C  4.372464 0.251465 -0.766163
C  -1.542729 0.859523 0.071831
C  -0.655485 1.923955 -1.893704
C  -0.218828 -2.300151 2.051186
C  -0.186402 -2.701458 -0.748832
C  -2.48074 0.216696 -0.721421
C  -1.605398 1.28207 -2.669222
C  -0.936253 -3.333511 1.467682
C  -0.921923 -3.530233 0.085093
C  -2.521015 0.411195 -2.090913
H  2.189902 1.979888 -0.931322
H  2.562075 2.233876 0.762795
H  -0.875166 3.051762 1.883822
H  0.900099 3.043815 2.337063
H  3.550125 -1.272337 0.50569
H  3.86938 0.246728 1.316519
H  5.386314 -0.109663 -0.59324
H  4.047321 -0.149907 -1.724336
H  4.427838 1.33611 -0.853774
H  -1.52864 0.692367 1.141406
H  0.065801 2.582767 -2.360805
H  -0.23728 -2.144422 3.121765
H  -0.18163 -2.851668 -1.820323
H  -1.633999 1.447331 -3.737812
H  -1.524097 -3.995977 2.08879
H  -1.499298 -4.341168 -0.338154
H  -3.252027 -0.100513 -2.701923
elementType: Cl O C H
totalener: -1458.32071207 hartree
nucrepener: 2298.08608814 hartree
electener: -3756.40680021 hartree
oneelecener: -6562.44522326 hartree
twoeener: 2806.03842305 hartree
cpcmener: -0.03579675 hartree
kineticenergy: 1453.35658510 hartree
xcener: -118.117116559810 hartree
chargesum: -0.0000000
charge: -0.096027 -0.454301 -0.425643 -0.424807 0.272859 -0.277150 0.446871 0.084213 -0.140844 0.091054 0.171525 0.211469 -0.049186 -0.020251 -0.299939 -0.198264 -0.260714 -0.131785 -0.180848 0.066345 -0.142690 -0.117032 -0.112308 -0.139019 0.122573 0.115446 0.093236 0.079598 0.109987 0.095117 0.104741 0.088738 0.091207 0.144720 0.147981 0.148508 0.146952 0.161664 0.165338 0.165773 0.144893
qa: -0.0960 -0.4543 -0.4256 -0.4248 0.2729 -0.2771 0.4469 0.0842 -0.1408 0.0911 0.1715 0.2115 -0.0492 -0.0203 -0.2999 -0.1983 -0.2607 -0.1318 -0.1808 0.0663 -0.1427 -0.1170 -0.1123 -0.1390 0.1226 0.1154 0.0932 0.0796 0.1100 0.0951 0.1047 0.0887 0.0912 0.1447 0.1480 0.1485 0.1470 0.1617 0.1653 0.1658 0.1449
va: 1.2077 1.9092 2.0593 2.0399 3.6238 3.9157 3.2789 3.9674 3.8776 3.5078 4.0790 4.1294 3.5442 3.5148 3.9479 3.9771 3.9702 3.9725 3.9778 3.8467 3.9101 3.8926 3.8782 3.9688 1.0073 1.0108 1.0028 1.0115 1.0012 1.0120 1.0020 1.0117 0.9962 1.0137 1.0068 1.0071 1.0106 0.9884 0.9874 0.9878 1.0044
dispcorr: -0.028451031 hartree
energy: -1458.349163102245
dipole: 20.38265 -20.52678 -0.14413 2.75270 -4.67851 -1.92581 -1.77483 1.94250 0.16768
magnitude: 1.93846 au
magnitude: 4.92717 debye
