program: Orca
programVersion: 5.0.2
elementType: Cl O O O C C C C C C C C C C C C C C C C C C C C H H H H H H H H H H H H H H H H H
charge: 0
multiplicity: 1
keywords: wb97x-d3
keywords: def2-TZVPP
keywords: def2/J RIJCOSX
keywords: DEFGRID2
keywords: scfconv7
keywords: smallprint printgap noloewdin
keywords: NOSOSCF
formula: C20H17ClO3
InChI: InChI=1/C20H17ClO3/c1-2-19(17(22)15-8-3-4-9-16(15)18(19)23)11-20(12-24-20)13-6-5-7-14(21)10-13/h3-10H,2,11-12H2,1H3
41 atoms
Cl -2.790097 0.343333 -3.48273
O  0.366247 3.54467 -0.096464
O  2.038173 0.607534 2.583107
O  0.905442 -1.121262 -1.644983
C  0.424734 2.146038 0.152134
C  1.723601 1.502959 -0.292913
C  1.953994 0.07374 0.209218
C  0.421845 3.101056 1.255077
C  3.440665 -0.337695 0.02632
C  -0.828492 1.397259 -0.17441
C  1.637181 -0.104234 1.690983
C  1.069522 -0.976489 -0.455491
C  0.782383 -1.293455 1.848804
C  0.456594 -1.803961 0.599194
C  3.99181 -0.20311 -1.38378
C  -1.208557 1.265091 -1.507338
C  -1.5832 0.787608 0.819862
C  0.278348 -1.857377 3.010082
C  -0.384206 -2.896338 0.463089
C  -2.322594 0.50945 -1.821825
C  -2.696111 0.028021 0.485891
C  -0.566135 -2.94995 2.87986
C  -0.894448 -3.462064 1.622038
C  -3.070888 -0.123414 -0.8392
H  1.757015 1.497906 -1.385919
H  2.556742 2.127198 0.03981
H  -0.481477 3.257019 1.83803
H  1.348128 3.312828 1.781008
H  3.56794 -1.36703 0.372582
H  4.028294 0.289547 0.700749
H  3.462154 -0.82136 -2.106418
H  3.967379 0.826393 -1.737339
H  5.033921 -0.521363 -1.390239
H  -0.628091 1.734202 -2.291913
H  -1.299037 0.894173 1.859083
H  0.524745 -1.456923 3.984673
H  -0.645574 -3.288965 -0.510714
H  -3.27375 -0.455707 1.261505
H  -0.983513 -3.412962 3.763985
H  -1.560999 -4.311546 1.555459
H  -3.934305 -0.719125 -1.101832
elementType: Cl O C H
totalener: -1458.32075293 hartree
nucrepener: 2267.53192948 hartree
electener: -3725.85268240 hartree
oneelecener: -6501.30897886 hartree
twoeener: 2775.45629646 hartree
cpcmener: -0.03795331 hartree
kineticenergy: 1453.35938275 hartree
xcener: -118.116754975625 hartree
chargesum: 0.0000000
charge: -0.094046 -0.454165 -0.425748 -0.425365 0.271462 -0.274091 0.445287 0.084489 -0.137125 0.094374 0.177077 0.202369 -0.057358 -0.009359 -0.298596 -0.274184 -0.186518 -0.122565 -0.207104 0.129466 -0.215688 -0.122017 -0.087305 -0.134903 0.124141 0.116257 0.092963 0.080800 0.108873 0.094236 0.088412 0.090703 0.104244 0.131610 0.157057 0.149182 0.146074 0.158485 0.165856 0.166922 0.145796
qa: -0.0940 -0.4542 -0.4257 -0.4254 0.2715 -0.2741 0.4453 0.0845 -0.1371 0.0944 0.1771 0.2024 -0.0574 -0.0094 -0.2986 -0.2742 -0.1865 -0.1226 -0.2071 0.1295 -0.2157 -0.1220 -0.0873 -0.1349 0.1241 0.1163 0.0930 0.0808 0.1089 0.0942 0.0884 0.0907 0.1042 0.1316 0.1571 0.1492 0.1461 0.1585 0.1659 0.1669 0.1458
va: 1.2117 1.9082 2.0598 2.0411 3.6260 3.9109 3.2863 3.9666 3.8737 3.5014 4.0825 4.1292 3.5720 3.5115 3.9489 4.0616 3.9139 3.9630 3.9964 3.8026 3.9363 3.9186 3.8754 3.9510 1.0069 1.0105 1.0025 1.0116 1.0017 1.0128 1.0116 0.9967 1.0021 1.0266 0.9988 1.0072 1.0119 0.9947 0.9881 0.9872 1.0033
dispcorr: -0.027477605 hartree
energy: -1458.348230530328
dipole: 16.44012 -16.74358 -0.30346 -2.50222 0.36977 -2.13246 10.91704 -8.70999 2.20705
magnitude: 3.08391 au
magnitude: 7.83868 debye
