program: Orca
programVersion: 5.0.2
elementType: Cl O O O C C C C C C C C C C C C C C C C C C C C H H H H H H H H H H H H H H H H H
charge: 0
multiplicity: 1
keywords: wb97x-d3
keywords: def2-TZVPP
keywords: def2/J RIJCOSX
keywords: DEFGRID2
keywords: scfconv7
keywords: smallprint printgap noloewdin
keywords: NOSOSCF
formula: C20H17ClO3
InChI: InChI=1/C20H17ClO3/c1-2-19(17(22)15-8-3-4-9-16(15)18(19)23)11-20(12-24-20)13-6-5-7-14(21)10-13/h3-10H,2,11-12H2,1H3
41 atoms
Cl -2.479325 -0.585031 -3.225469
O  0.503742 3.59976 -0.678335
O  1.646695 0.945187 2.544837
O  1.275969 -1.224906 -1.617136
C  0.532635 2.281692 -0.142098
C  1.828171 1.543952 -0.427691
C  1.965008 0.17717 0.25721
C  0.547806 3.444612 0.737879
C  3.458291 -0.23244 0.376877
C  -0.727361 1.491103 -0.305198
C  1.391176 0.1497 1.67011
C  1.197148 -0.938387 -0.444307
C  0.484057 -1.005653 1.786984
C  0.357013 -1.626812 0.551532
C  4.241638 -0.249129 -0.925939
C  -1.030236 0.948258 -1.55114
C  -1.558133 1.225781 0.77749
C  -0.232003 -1.442392 2.889832
C  -0.496391 -2.703452 0.369926
C  -2.135328 0.127017 -1.683321
C  -2.669206 0.40901 0.624411
C  -1.084315 -2.522571 2.714405
C  -1.217216 -3.14356 1.470242
C  -2.962525 -0.155316 -0.606516
H  1.923919 1.401791 -1.507555
H  2.664161 2.178167 -0.124372
H  -0.349955 3.745475 1.270077
H  1.48005 3.735704 1.213308
H  3.520483 -1.214113 0.854138
H  3.92381 0.477892 1.063852
H  5.285406 -0.479776 -0.709102
H  3.88475 -1.004005 -1.624194
H  4.223656 0.717023 -1.429692
H  -0.39259 1.145483 -2.403573
H  -1.332314 1.63862 1.752126
H  -0.142167 -0.956604 3.85234
H  -0.604268 -3.181369 -0.594759
H  -3.306289 0.198362 1.472472
H  -1.663821 -2.889635 3.550771
H  -1.897704 -3.977968 1.367262
H  -3.818868 -0.805204 -0.722153
elementType: Cl O C H
totalener: -1458.31992799 hartree
nucrepener: 2297.46034765 hartree
electener: -3755.78027564 hartree
oneelecener: -6561.17344503 hartree
twoeener: 2805.39316939 hartree
cpcmener: -0.03742579 hartree
kineticenergy: 1453.35958744 hartree
xcener: -118.118970976724 hartree
chargesum: -0.0000000
charge: -0.093467 -0.456039 -0.421008 -0.423524 0.259585 -0.294941 0.479900 0.083206 -0.125140 0.088570 0.165813 0.118279 -0.069334 0.057026 -0.297709 -0.261437 -0.185551 -0.114785 -0.213314 0.158169 -0.166309 -0.131042 -0.079244 -0.187822 0.124703 0.115132 0.094508 0.081546 0.106346 0.093836 0.103726 0.087588 0.091662 0.133774 0.153429 0.146948 0.143980 0.157950 0.165527 0.165885 0.143581
qa: -0.0935 -0.4560 -0.4210 -0.4235 0.2596 -0.2949 0.4799 0.0832 -0.1251 0.0886 0.1658 0.1183 -0.0693 0.0570 -0.2977 -0.2614 -0.1856 -0.1148 -0.2133 0.1582 -0.1663 -0.1310 -0.0792 -0.1878 0.1247 0.1151 0.0945 0.0815 0.1063 0.0938 0.1037 0.0876 0.0917 0.1338 0.1534 0.1469 0.1440 0.1579 0.1655 0.1659 0.1436
va: 1.2136 1.9061 2.0621 2.0446 3.6074 3.9363 3.1917 3.9743 3.8592 3.5181 4.0940 4.1473 3.6049 3.4286 3.9495 4.0385 3.9184 3.9511 3.9816 3.7570 3.8888 3.9153 3.8665 3.9651 1.0087 1.0065 1.0021 1.0076 1.0034 1.0129 1.0018 1.0103 0.9977 1.0275 1.0065 1.0088 1.0137 0.9940 0.9887 0.9877 1.0063
dispcorr: -0.028663189 hartree
energy: -1458.348591180272
dipole: 15.81388 -16.44179 -0.62791 1.24261 -2.82517 -1.58256 11.38927 -9.05558 2.33369
magnitude: 2.88875 au
magnitude: 7.34262 debye
