program: Orca
programVersion: 5.0.2
elementType: Cl O O O C C C C C C C C C C C C C C C C C C C C H H H H H H H H H H H H H H H H H
charge: 0
multiplicity: 1
keywords: wb97x-d3
keywords: def2-TZVPP
keywords: def2/J RIJCOSX
keywords: DEFGRID2
keywords: scfconv7
keywords: smallprint printgap noloewdin
keywords: NOSOSCF
formula: C20H17ClO3
InChI: InChI=1/C20H17ClO3/c1-2-19(17(22)15-8-3-4-9-16(15)18(19)23)11-20(12-24-20)13-6-5-7-14(21)10-13/h3-10H,2,11-12H2,1H3
41 atoms
Cl -3.367651 2.941288 1.932289
O  0.566584 0.662796 -2.55243
O  0.241616 0.023624 2.015378
O  3.189922 -0.750234 -1.577516
C  0.301795 1.39017 -1.365617
C  1.475814 1.520606 -0.418714
C  1.920426 0.214173 0.261674
C  0.352025 2.065174 -2.662251
C  3.115671 0.513058 1.184263
C  -1.036061 1.129885 -0.747442
C  0.797114 -0.450835 1.051346
C  2.291213 -0.843171 -0.773469
C  0.533843 -1.775788 0.464145
C  1.393026 -1.998729 -0.604973
C  3.676559 -0.697745 1.916445
C  -1.53959 2.046999 0.170761
C  -1.764705 -0.014117 -1.045877
C  -0.415802 -2.716233 0.83425
C  1.332259 -3.171184 -1.344343
C  -2.751383 1.796191 0.786457
C  -2.979438 -0.248557 -0.415399
C  -0.481788 -3.8870 0.095961
C  0.381645 -4.111662 -0.980784
C  -3.483404 0.65042 0.50994
H  2.335526 1.92098 -0.960828
H  1.234882 2.249187 0.358355
H  -0.573745 2.362469 -3.145817
H  1.224005 2.658227 -2.923469
H  2.795627 1.268302 1.905821
H  3.897551 0.975324 0.577577
H  4.050938 -1.460094 1.231651
H  4.512942 -0.394694 2.546504
H  2.9391 -1.16779 2.568766
H  -0.984949 2.946071 0.408334
H  -1.388656 -0.735099 -1.758703
H  -1.090181 -2.538895 1.661422
H  1.999903 -3.346816 -2.177363
H  -3.539036 -1.146386 -0.641629
H  -1.214285 -4.641262 0.350177
H  0.301609 -5.035693 -1.537519
H  -4.427614 0.464033 1.003077
elementType: Cl O C H
totalener: -1458.32289269 hartree
nucrepener: 2255.66166049 hartree
electener: -3713.98455318 hartree
oneelecener: -6478.25374756 hartree
twoeener: 2764.26919438 hartree
cpcmener: -0.03965124 hartree
kineticenergy: 1453.36156274 hartree
xcener: -118.117716453402 hartree
chargesum: 0.0000000
charge: -0.096052 -0.449177 -0.417878 -0.422001 0.345575 -0.175710 0.561210 0.045695 -0.134531 0.007386 0.034959 -0.023053 0.026653 0.079593 -0.283340 -0.242474 -0.224189 -0.178358 -0.143838 0.120507 -0.173491 -0.103016 -0.105596 -0.151664 0.113072 0.119758 0.091715 0.089749 0.094845 0.097783 0.090643 0.104633 0.091636 0.127111 0.144360 0.149246 0.149133 0.158942 0.166849 0.167743 0.145568
qa: -0.0961 -0.4492 -0.4179 -0.4220 0.3456 -0.1757 0.5612 0.0457 -0.1345 0.0074 0.0350 -0.0231 0.0267 0.0796 -0.2833 -0.2425 -0.2242 -0.1784 -0.1438 0.1205 -0.1735 -0.1030 -0.1056 -0.1517 0.1131 0.1198 0.0917 0.0897 0.0948 0.0978 0.0906 0.1046 0.0916 0.1271 0.1444 0.1492 0.1491 0.1589 0.1668 0.1677 0.1456
va: 1.2097 1.9152 2.0618 2.0659 3.5923 3.8556 3.0911 3.9587 3.8397 3.5255 4.1172 4.1446 3.3629 3.3575 3.9544 4.0707 3.9606 3.9751 4.0067 3.8137 3.9337 3.9039 3.9063 3.9801 1.0175 1.0144 1.0041 1.0032 1.0133 1.0125 1.0009 1.0033 1.0011 1.0265 1.0136 1.0093 1.0066 0.9935 0.9875 0.9871 1.0037
dispcorr: -0.026685125 hartree
energy: -1458.349577818862
dipole: 16.15541 -16.69506 -0.53966 -8.98407 7.89903 -1.08504 -3.00075 2.59312 -0.40763
magnitude: 1.27856 au
magnitude: 3.24983 debye
