program: Orca
programVersion: 5.0.2
elementType: Cl O O O C C C C C C C C C C C C C C C C C C C C H H H H H H H H H H H H H H H H H
charge: 0
multiplicity: 1
keywords: wb97x-d3
keywords: def2-TZVPP
keywords: def2/J RIJCOSX
keywords: DEFGRID2
keywords: scfconv7
keywords: smallprint printgap noloewdin
keywords: NOSOSCF
formula: C20H17ClO3
InChI: InChI=1/C20H17ClO3/c1-2-19(17(22)15-8-3-4-9-16(15)18(19)23)11-20(12-24-20)13-6-5-7-14(21)10-13/h3-10H,2,11-12H2,1H3
41 atoms
Cl -2.780724 -0.065741 -3.268745
O  0.372212 3.546033 -0.238026
O  1.901681 0.641015 2.556323
O  1.058321 -1.131763 -1.720083
C  0.452883 2.169278 0.101704
C  1.74573 1.511192 -0.343559
C  1.970325 0.089694 0.186415
C  0.483571 3.198614 1.136096
C  3.470085 -0.301639 0.096017
C  -0.804258 1.388583 -0.122813
C  1.563806 -0.07918 1.647842
C  1.134247 -0.970601 -0.525919
C  0.700577 -1.270232 1.759368
C  0.445706 -1.783499 0.494702
C  4.096677 -0.19946 -1.285116
C  -1.192097 1.092439 -1.426659
C  -1.561653 0.913907 0.941812
C  0.129411 -1.830107 2.890921
C  -0.391635 -2.872558 0.314106
C  -2.314812 0.313935 -1.642714
C  -2.687231 0.136583 0.707915
C  -0.708152 -2.921774 2.716085
C  -0.967322 -3.435642 1.443201
C  -3.070344 -0.175264 -0.586605
H  1.770704 1.483127 -1.436524
H  2.582368 2.141543 -0.032136
H  -0.396701 3.393031 1.743041
H  1.428089 3.447769 1.612221
H  3.596186 -1.319029 0.477555
H  4.009443 0.354377 0.783914
H  5.154613 -0.456005 -1.215973
H  3.646709 -0.881946 -2.004264
H  4.03807 0.809714 -1.693046
H  -0.611549 1.456163 -2.265363
H  -1.270519 1.140065 1.95977
H  0.322082 -1.428186 3.877282
H  -0.597463 -3.266615 -0.672699
H  -3.269577 -0.236036 1.540176
H  -1.174702 -3.382867 3.576763
H  -1.631483 -4.283834 1.341036
H  -3.943813 -0.786667 -0.769115
elementType: Cl O C H
totalener: -1458.32833120 hartree
nucrepener: 2280.02214955 hartree
electener: -3738.35048075 hartree
oneelecener: -6526.20661675 hartree
twoeener: 2787.85613600 hartree
cpcmener: -0.03064179 hartree
kineticenergy: 1453.34684729 hartree
xcener: -118.112484468234 hartree
chargesum: -0.0000000
charge: -0.091387 -0.433682 -0.393445 -0.391111 0.256108 -0.286299 0.475789 0.084111 -0.135683 0.098095 0.140635 0.130511 -0.057882 0.022098 -0.295345 -0.264901 -0.192616 -0.120731 -0.209541 0.147506 -0.183434 -0.128436 -0.080864 -0.168378 0.122919 0.113732 0.089227 0.076613 0.104723 0.093699 0.102729 0.089598 0.090346 0.129370 0.151258 0.147800 0.145467 0.154307 0.162062 0.163400 0.141631
qa: -0.0914 -0.4337 -0.3934 -0.3911 0.2561 -0.2863 0.4758 0.0841 -0.1357 0.0981 0.1406 0.1305 -0.0579 0.0221 -0.2953 -0.2649 -0.1926 -0.1207 -0.2095 0.1475 -0.1834 -0.1284 -0.0809 -0.1684 0.1229 0.1137 0.0892 0.0766 0.1047 0.0937 0.1027 0.0896 0.0903 0.1294 0.1513 0.1478 0.1455 0.1543 0.1621 0.1634 0.1416
va: 1.2150 1.9345 2.0978 2.0837 3.6425 3.9225 3.1944 3.9786 3.8685 3.5063 4.1228 4.1712 3.5806 3.4576 3.9489 4.0522 3.9334 3.9624 3.9931 3.7921 3.9121 3.9248 3.8725 3.9734 1.0084 1.0082 1.0015 1.0089 1.0029 1.0124 1.0020 1.0100 0.9977 1.0274 1.0044 1.0082 1.0122 0.9957 0.9898 0.9885 1.0059
dispcorr: -0.027916745 hartree
energy: -1458.356247943455
dipole: 16.65610 -16.95568 -0.29958 -0.89724 -0.93603 -1.83328 10.68144 -8.60779 2.07366
magnitude: 2.78401 au
magnitude: 7.07639 debye
