program: Orca
programVersion: 5.0.2
elementType: Cl O O O C C C C C C C C C C C C C C C C C C C C H H H H H H H H H H H H H H H H H
charge: 0
multiplicity: 1
keywords: wb97x-d3
keywords: def2-TZVPP
keywords: def2/J RIJCOSX
keywords: DEFGRID2
keywords: scfconv7
keywords: smallprint printgap noloewdin
keywords: NOSOSCF
formula: C20H17ClO3
InChI: InChI=1/C20H17ClO3/c1-2-19(17(22)15-8-3-4-9-16(15)18(19)23)11-20(12-24-20)13-6-5-7-14(21)10-13/h3-10H,2,11-12H2,1H3
41 atoms
Cl -3.786595 -0.541467 0.463211
O  0.513002 3.711412 -0.166536
O  1.191701 0.383888 2.567926
O  1.88288 -0.67902 -1.965914
C  0.539336 2.307363 0.040439
C  1.931577 1.714462 -0.067134
C  2.046727 0.228603 0.292808
C  0.227641 3.219959 1.136134
C  3.514177 -0.137948 0.639916
C  -0.567542 1.548755 -0.62346
C  1.198104 -0.173509 1.496322
C  1.544027 -0.70332 -0.806984
C  0.400703 -1.359619 1.131642
C  0.591785 -1.657804 -0.211009
C  4.547663 0.218286 -0.416218
C  -1.57028 0.954696 0.134498
C  -0.571782 1.39495 -2.007165
C  -0.476471 -2.092926 1.913957
C  -0.093624 -2.69452 -0.823185
C  -2.549996 0.203748 -0.495008
C  -1.560686 0.644818 -2.621658
C  -1.159965 -3.136459 1.307538
C  -0.972936 -3.432283 -0.044279
C  -2.556518 0.036387 -1.869906
H  2.294285 1.850562 -1.090009
H  2.603038 2.288747 0.575991
H  -0.798586 3.345908 1.471742
H  0.980559 3.419423 1.894132
H  3.5728 -1.207225 0.862247
H  3.759304 0.38267 1.569117
H  5.539145 -0.058655 -0.055009
H  4.388926 -0.305971 -1.357767
H  4.570044 1.287722 -0.625433
H  -1.581612 1.066466 1.211315
H  0.204611 1.853653 -2.606784
H  -0.631739 -1.856409 2.958805
H  0.046922 -2.91975 -1.872594
H  -1.559845 0.525363 -3.697232
H  -1.856627 -3.728756 1.886204
H  -1.528802 -4.247423 -0.48892
H  -3.3239 -0.553804 -2.35197
elementType: Cl O C H
totalener: -1458.32823215 hartree
nucrepener: 2305.38513950 hartree
electener: -3763.71337165 hartree
oneelecener: -6576.86852069 hartree
twoeener: 2813.15514905 hartree
cpcmener: -0.02896528 hartree
kineticenergy: 1453.35507553 hartree
xcener: -118.115455525006 hartree
chargesum: -0.0000000
charge: -0.094797 -0.433870 -0.392355 -0.394163 0.254681 -0.287610 0.487001 0.082991 -0.133354 0.091173 0.134149 0.104667 -0.034983 0.031503 -0.295007 -0.205459 -0.243068 -0.126599 -0.208871 0.106032 -0.112618 -0.141258 -0.072590 -0.188189 0.121919 0.111850 0.089372 0.075941 0.104201 0.092722 0.102498 0.089687 0.089989 0.135771 0.145774 0.145467 0.144545 0.158373 0.160789 0.162600 0.141101
qa: -0.0948 -0.4339 -0.3924 -0.3942 0.2547 -0.2876 0.4870 0.0830 -0.1334 0.0912 0.1341 0.1047 -0.0350 0.0315 -0.2950 -0.2055 -0.2431 -0.1266 -0.2089 0.1060 -0.1126 -0.1413 -0.0726 -0.1882 0.1219 0.1118 0.0894 0.0759 0.1042 0.0927 0.1025 0.0897 0.0900 0.1358 0.1458 0.1455 0.1445 0.1584 0.1608 0.1626 0.1411
va: 1.2073 1.9342 2.0978 2.0797 3.6367 3.9375 3.1666 3.9846 3.8668 3.5142 4.1214 4.1948 3.5454 3.4447 3.9472 4.0118 3.9604 3.9514 3.9875 3.8018 3.8839 3.9019 3.8613 3.9981 1.0089 1.0073 1.0017 1.0069 1.0035 1.0131 1.0021 1.0110 0.9975 1.0234 1.0078 1.0092 1.0129 0.9892 0.9901 0.9879 1.0073
dispcorr: -0.028889319 hartree
energy: -1458.357121472737
dipole: 21.05988 -21.29945 -0.23957 1.78109 -3.53578 -1.75470 -2.17917 2.38745 0.20828
magnitude: 1.78318 au
magnitude: 4.53249 debye
