program: Orca
programVersion: 5.0.2
elementType: Cl O O O C C C C C C C C C C C C C C C C C C C C H H H H H H H H H H H H H H H H H
charge: 0
multiplicity: 1
keywords: wb97x-d3
keywords: def2-TZVPP
keywords: def2/J RIJCOSX
keywords: DEFGRID2
keywords: scfconv7
keywords: smallprint printgap noloewdin
keywords: NOSOSCF
formula: C20H17ClO3
InChI: InChI=1/C20H17ClO3/c1-2-19(17(22)15-8-3-4-9-16(15)18(19)23)11-20(12-24-20)13-6-5-7-14(21)10-13/h3-10H,2,11-12H2,1H3
41 atoms
Cl -3.955711 -0.722187 -0.456059
O  0.696185 1.027391 -2.193763
O  0.527749 0.316669 2.418644
O  3.062793 -0.854832 -1.377747
C  0.586202 1.736507 -0.974246
C  1.81208 1.666815 -0.0850
C  2.092059 0.291826 0.548854
C  0.679016 2.444923 -2.252542
C  3.343315 0.340152 1.453617
C  -0.75389 1.645283 -0.314354
C  0.914472 -0.196983 1.396771
C  2.207474 -0.786032 -0.528496
C  0.356246 -1.40927 0.772856
C  1.10071 -1.745567 -0.349218
C  4.619847 0.876709 0.823785
C  -1.647301 0.645175 -0.675912
C  -1.104488 2.55461 0.679572
C  -0.76095 -2.142474 1.144002
C  0.753278 -2.827897 -1.144006
C  -2.866336 0.55534 -0.023009
C  -2.330811 2.454434 1.313909
C  -1.117763 -3.21805 0.347056
C  -0.369397 -3.55683 -0.784135
C  -3.223963 1.447141 0.973102
H  2.681721 1.952325 -0.679378
H  1.728733 2.408684 0.713169
H  -0.213654 2.888703 -2.684326
H  1.615033 2.918901 -2.536534
H  3.52809 -0.66499 1.842789
H  3.091154 0.958877 2.318444
H  4.947267 0.294202 -0.034811
H  4.523698 1.914762 0.508314
H  5.421673 0.844816 1.561076
H  -1.392562 -0.068905 -1.447349
H  -0.417162 3.341269 0.96458
H  -1.346193 -1.874022 2.013953
H  1.329029 -3.088677 -2.022769
H  -2.598487 3.16272 2.086969
H  -1.992435 -3.804047 0.59675
H  -0.678146 -4.399546 -1.388824
H  -4.177271 1.364155 1.477318
elementType: Cl O C H
totalener: -1458.32867890 hartree
nucrepener: 2285.21650259 hartree
electener: -3743.54518149 hartree
oneelecener: -6537.22339453 hartree
twoeener: 2793.67821304 hartree
cpcmener: -0.03081881 hartree
kineticenergy: 1453.35747056 hartree
xcener: -118.115958979158 hartree
chargesum: -0.0000000
charge: -0.096628 -0.428944 -0.391638 -0.399561 0.323639 -0.208289 0.526455 0.043914 -0.132593 0.032391 0.088520 0.033728 0.022164 0.047882 -0.302822 -0.240090 -0.251493 -0.171159 -0.156183 0.099469 -0.127628 -0.121922 -0.095456 -0.160013 0.116035 0.126186 0.087687 0.086048 0.102079 0.090614 0.092325 0.085201 0.100746 0.125476 0.137923 0.145583 0.146516 0.156409 0.161736 0.163620 0.142072
qa: -0.0966 -0.4289 -0.3916 -0.3996 0.3236 -0.2083 0.5265 0.0439 -0.1326 0.0324 0.0885 0.0337 0.0222 0.0479 -0.3028 -0.2401 -0.2515 -0.1712 -0.1562 0.0995 -0.1276 -0.1219 -0.0955 -0.1600 0.1160 0.1262 0.0877 0.0860 0.1021 0.0906 0.0923 0.0852 0.1007 0.1255 0.1379 0.1456 0.1465 0.1564 0.1617 0.1636 0.1421
va: 1.2109 1.9342 2.0957 2.0848 3.6347 3.9137 3.1591 3.9703 3.8496 3.4969 4.1579 4.1821 3.4555 3.5102 3.9425 4.0556 3.9817 3.9388 4.0045 3.8389 3.9120 3.8945 3.9021 3.9933 1.0068 1.0102 1.0035 1.0027 1.0037 1.0173 1.0131 0.9955 1.0021 1.0356 1.0093 1.0107 1.0089 0.9905 0.9917 0.9880 1.0059
dispcorr: -0.027507996 hartree
energy: -1458.356186894733
dipole: 20.60099 -20.99860 -0.39762 8.63246 -8.13517 0.49729 3.82729 -3.46273 0.36455
magnitude: 0.73369 au
magnitude: 1.86488 debye
