program: Orca
programVersion: 5.0.2
elementType: Cl O O O C C C C C C C C C C C C C C C C C C C C H H H H H H H H H H H H H H H H H
charge: 0
multiplicity: 1
keywords: wb97x-d3
keywords: def2-TZVPP
keywords: def2/J RIJCOSX
keywords: DEFGRID2
keywords: scfconv7
keywords: smallprint printgap noloewdin
keywords: NOSOSCF
formula: C20H17ClO3
InChI: InChI=1/C20H17ClO3/c1-2-19(17(22)15-8-3-4-9-16(15)18(19)23)11-20(12-24-20)13-6-5-7-14(21)10-13/h3-10H,2,11-12H2,1H3
41 atoms
Cl -2.900249 0.397832 -3.440117
O  0.381317 3.542556 -0.151457
O  1.933229 0.65173 2.579906
O  0.948742 -1.138747 -1.656761
C  0.428419 2.155213 0.114571
C  1.722577 1.49512 -0.321219
C  1.94637 0.07812 0.211537
C  0.439752 3.133167 1.19928
C  3.436857 -0.332076 0.075851
C  -0.830882 1.404913 -0.185374
C  1.589824 -0.080302 1.688764
C  1.083968 -0.983843 -0.472553
C  0.763354 -1.298972 1.833662
C  0.465724 -1.81759 0.583149
C  4.019468 -0.228443 -1.326245
C  -1.247611 1.278352 -1.506223
C  -1.568703 0.802186 0.824918
C  0.267399 -1.88079 2.989514
C  -0.340616 -2.934199 0.439787
C  -2.383533 0.546828 -1.798315
C  -2.702804 0.064116 0.518806
C  -0.538447 -3.000133 2.853045
C  -0.840948 -3.519486 1.591968
C  -3.116451 -0.071444 -0.794955
H  1.750973 1.459773 -1.414127
H  2.555736 2.130398 -0.009847
H  -0.460794 3.302025 1.784726
H  1.36863 3.331924 1.726786
H  3.560761 -1.354891 0.445267
H  4.00697 0.3060 0.756192
H  3.480011 -0.83878 -2.047517
H  4.020987 0.797854 -1.691857
H  5.055465 -0.566907 -1.314417
H  -0.685388 1.744017 -2.304799
H  -1.257868 0.904361 1.856742
H  0.501219 -1.468885 3.962391
H  -0.577162 -3.323248 -0.541489
H  -3.268243 -0.411119 1.308894
H  -0.944396 -3.480285 3.733671
H  -1.47848 -4.390763 1.518893
H  -3.99984 -0.643899 -1.041658
totalener: -1458.30262854 hartree
nucrepener: 2264.35115226 hartree
electener: -3722.65378080 hartree
oneelecener: -6494.29025536 hartree
twoeener: 2771.63647456 hartree
kineticenergy: 1453.40906077 hartree
xcener: -118.117022763358 hartree
chargesum: -0.0000000
charge: -0.072215 -0.357456 -0.306449 -0.300755 0.190453 -0.274944 0.477738 0.095015 -0.165174 0.127369 0.086512 0.105648 -0.090533 -0.003018 -0.272158 -0.211731 -0.208002 -0.122063 -0.174571 0.125175 -0.171543 -0.105393 -0.075395 -0.131740 0.115218 0.103133 0.061445 0.059863 0.092248 0.095043 0.101382 0.080614 0.093699 0.103491 0.135316 0.142918 0.139477 0.122040 0.135052 0.135856 0.118434
qa: -0.0722 -0.3575 -0.3064 -0.3008 0.1905 -0.2749 0.4777 0.0950 -0.1652 0.1274 0.0865 0.1056 -0.0905 -0.0030 -0.2722 -0.2117 -0.2080 -0.1221 -0.1746 0.1252 -0.1715 -0.1054 -0.0754 -0.1317 0.1152 0.1031 0.0614 0.0599 0.0922 0.0950 0.1014 0.0806 0.0937 0.1035 0.1353 0.1429 0.1395 0.1220 0.1351 0.1359 0.1184
va: 1.2346 2.0176 2.1798 2.1686 3.8013 3.9091 3.1477 4.0134 3.8955 3.4891 4.1401 4.2058 3.6080 3.5155 3.9471 4.0900 3.9775 4.0115 4.0428 3.9086 3.9735 3.9466 3.9104 4.0098 1.0098 1.0134 1.0023 1.0093 1.0041 1.0119 1.0117 1.0009 1.0043 1.0323 1.0037 1.0108 1.0146 1.0061 0.9994 0.9986 1.0130
dispcorr: -0.027298199 hartree
energy: -1458.329926741726
dipole: 16.97302 -17.06979 -0.09677 -2.75651 1.31328 -1.44322 10.96222 -9.64376 1.31846
magnitude: 1.95719 au
magnitude: 4.97479 debye
