program: Orca
programVersion: 5.0.2
elementType: Cl O O O C C C C C C C C C C C C C C C C C C C C H H H H H H H H H H H H H H H H H
charge: 0
multiplicity: 1
keywords: wb97x-d3
keywords: def2-TZVPP
keywords: def2/J RIJCOSX
keywords: DEFGRID2
keywords: scfconv7
keywords: smallprint printgap noloewdin
keywords: NOSOSCF
formula: C20H17ClO3
InChI: InChI=1/C20H17ClO3/c1-2-19(17(22)15-8-3-4-9-16(15)18(19)23)11-20(12-24-20)13-6-5-7-14(21)10-13/h3-10H,2,11-12H2,1H3
41 atoms
Cl -3.36919 1.705871 2.244025
O  0.857238 1.262735 -2.53904
O  0.610444 0.137551 2.313899
O  3.076789 -0.735624 -1.585908
C  0.47623 1.652253 -1.237952
C  1.604043 1.677287 -0.224909
C  2.043667 0.316985 0.355143
C  0.51482 2.615956 -2.344471
C  3.344561 0.50978 1.142249
C  -0.864328 1.144564 -0.805239
C  0.945555 -0.279118 1.236544
C  2.203526 -0.716623 -0.762253
C  0.3914 -1.458368 0.540681
C  1.108364 -1.70359 -0.621931
C  3.887086 -0.752892 1.79698
C  -1.438596 1.610878 0.371578
C  -1.546024 0.208024 -1.575269
C  -0.692292 -2.243395 0.899593
C  0.763585 -2.743876 -1.470035
C  -2.670635 1.125098 0.774222
C  -2.778477 -0.266851 -1.158946
C  -1.045843 -3.278136 0.049918
C  -0.326302 -3.525562 -1.121733
C  -3.351273 0.183084 0.019857
H  2.477853 2.123563 -0.705986
H  1.341794 2.33332 0.609877
H  -0.419224 2.944264 -2.792955
H  1.332985 3.330157 -2.409897
H  3.167365 1.27173 1.905444
H  4.092739 0.915459 0.45701
H  4.813123 -0.531398 2.326939
H  3.192647 -1.169345 2.52682
H  4.11534 -1.526901 1.063826
H  -0.929561 2.339543 0.988073
H  -1.102894 -0.162203 -2.488771
H  -1.248987 -2.038323 1.803992
H  1.3266 -2.929287 -2.375065
H  -3.29752 -1.005859 -1.754492
H  -1.892367 -3.90713 0.292165
H  -0.627751 -4.34268 -1.764096
H  -4.311102 -0.189635 0.349277
totalener: -1458.30351909 hartree
nucrepener: 2293.52049443 hartree
electener: -3751.82401352 hartree
oneelecener: -6552.85221835 hartree
twoeener: 2801.02820482 hartree
kineticenergy: 1453.41828420 hartree
xcener: -118.121136985989 hartree
chargesum: -0.0000000
charge: -0.069662 -0.358342 -0.287389 -0.284839 0.305886 -0.216119 0.551668 0.048397 -0.143155 -0.031949 -0.064264 -0.053017 0.064267 0.041238 -0.277254 -0.222827 -0.153955 -0.170527 -0.149003 0.120154 -0.152579 -0.100506 -0.072864 -0.147638 0.101251 0.108928 0.067693 0.059435 0.091912 0.090804 0.092396 0.091919 0.091912 0.109380 0.133884 0.139029 0.139264 0.122661 0.131811 0.134296 0.117703
qa: -0.0697 -0.3583 -0.2874 -0.2848 0.3059 -0.2161 0.5517 0.0484 -0.1432 -0.0319 -0.0643 -0.0530 0.0643 0.0412 -0.2773 -0.2228 -0.1540 -0.1705 -0.1490 0.1202 -0.1526 -0.1005 -0.0729 -0.1476 0.1013 0.1089 0.0677 0.0594 0.0919 0.0908 0.0924 0.0919 0.0919 0.1094 0.1339 0.1390 0.1393 0.1227 0.1318 0.1343 0.1177
va: 1.2385 1.9973 2.2024 2.2044 3.6857 3.9024 3.0707 3.9987 3.8594 3.5247 4.1968 4.1749 3.3258 3.4446 3.9520 4.0638 3.9489 4.0050 4.0271 3.9247 3.9157 3.9117 3.9033 3.9947 1.0127 1.0089 1.0024 1.0019 1.0136 1.0149 1.0055 1.0039 1.0029 1.0351 1.0267 1.0108 1.0115 1.0051 0.9999 0.9974 1.0147
dispcorr: -0.028182046 hartree
energy: -1458.331701135027
dipole: 16.03810 -16.63708 -0.59899 -4.55491 4.15790 -0.39701 -4.83856 4.36659 -0.47196
magnitude: 0.85974 au
magnitude: 2.18529 debye
