program: Orca
programVersion: 5.0.2
elementType: Cl O O O C C C C C C C C C C C C C C C C C C C C H H H H H H H H H H H H H H H H H
charge: 0
multiplicity: 1
keywords: wb97x-d3
keywords: def2-TZVPP
keywords: def2/J RIJCOSX
keywords: DEFGRID2
keywords: scfconv7
keywords: smallprint printgap noloewdin
keywords: NOSOSCF
formula: C20H17ClO3
InChI: InChI=1/C20H17ClO3/c1-2-19(17(22)15-8-3-4-9-16(15)18(19)23)11-20(12-24-20)13-6-5-7-14(21)10-13/h3-10H,2,11-12H2,1H3
41 atoms
Cl -3.586512 -0.925063 -0.141086
O  0.436098 3.695151 0.500732
O  1.505692 0.156161 2.678059
O  1.420081 -0.455549 -1.987827
C  0.460423 2.28965 0.355807
C  1.849143 1.728099 0.119957
C  1.993991 0.215704 0.2904
C  0.126316 2.910873 1.635305
C  3.492627 -0.185814 0.341337
C  -0.625709 1.718655 -0.498353
C  1.360962 -0.311096 1.578335
C  1.311618 -0.611731 -0.800825
C  0.554065 -1.502434 1.23862
C  0.521727 -1.674136 -0.13702
C  4.336741 0.28934 -0.832913
C  -1.537437 0.814262 0.027366
C  -0.685348 2.044855 -1.84918
C  -0.142801 -2.349965 2.085568
C  -0.20999 -2.696993 -0.717055
C  -2.479703 0.226637 -0.802638
C  -1.636343 1.459091 -2.664053
C  -0.874052 -3.376885 1.510765
C  -0.909852 -3.545804 0.125154
C  -2.537518 0.537034 -2.149176
H  2.159805 1.99161 -0.895007
H  2.544153 2.22769 0.799996
H  -0.909379 2.943679 1.965072
H  0.860279 2.908324 2.436299
H  3.566114 -1.274688 0.423483
H  3.902813 0.21629 1.271455
H  3.958513 -0.067633 -1.788488
H  4.393918 1.376463 -0.880194
H  5.35616 -0.079844 -0.720551
H  -1.514901 0.558585 1.078831
H  0.020531 2.751853 -2.264779
H  -0.11757 -2.206819 3.157693
H  -0.241661 -2.814331 -1.791861
H  -1.676815 1.710562 -3.715195
H  -1.435104 -4.054856 2.14017
H  -1.501312 -4.349254 -0.293202
H  -3.27557 0.069608 -2.786092
totalener: -1458.30317905 hartree
nucrepener: 2294.95133328 hartree
electener: -3753.25451233 hartree
oneelecener: -6555.60927530 hartree
twoeener: 2802.35476297 hartree
kineticenergy: 1453.41320493 hartree
xcener: -118.119087437791 hartree
chargesum: 0.0000000
charge: -0.082985 -0.358561 -0.307663 -0.304328 0.179554 -0.258859 0.461428 0.091314 -0.163562 0.111837 0.082253 0.122456 -0.094661 -0.001310 -0.276408 -0.216366 -0.180186 -0.122370 -0.166869 0.059254 -0.104001 -0.078528 -0.095908 -0.123722 0.110365 0.104655 0.063201 0.062090 0.092865 0.095442 0.100762 0.079982 0.093838 0.129071 0.110592 0.141483 0.136331 0.124704 0.132700 0.130851 0.119261
qa: -0.0830 -0.3586 -0.3077 -0.3043 0.1796 -0.2589 0.4614 0.0913 -0.1636 0.1118 0.0823 0.1225 -0.0947 -0.0013 -0.2764 -0.2164 -0.1802 -0.1224 -0.1669 0.0593 -0.1040 -0.0785 -0.0959 -0.1237 0.1104 0.1047 0.0632 0.0621 0.0929 0.0954 0.1008 0.0800 0.0938 0.1291 0.1106 0.1415 0.1363 0.1247 0.1327 0.1309 0.1193
va: 1.2239 2.0149 2.1815 2.1665 3.8227 3.9163 3.1753 4.0100 3.8941 3.5178 4.1543 4.1897 3.5717 3.5239 3.9467 3.9822 4.0441 4.0338 4.0339 3.9292 3.9695 3.9254 3.9253 4.0185 1.0103 1.0153 1.0024 1.0096 1.0045 1.0121 1.0126 0.9999 1.0046 1.0142 1.0163 1.0104 1.0158 1.0006 0.9989 1.0012 1.0123
dispcorr: -0.028278705 hartree
energy: -1458.331457759627
dipole: 20.15969 -20.20788 -0.04820 3.11621 -4.32566 -1.20945 -1.47367 1.41343 -0.06025
magnitude: 1.21191 au
magnitude: 3.08042 debye
