program: Gaussian 09
title: 000056022
version: EM64L-G09RevD.01
frameworkgroup: C1[X(C15H18ClN3O)]
method: RPBEPBE
basis: SDD
operation: Freq
keyword: #p
keyword: freq=noraman
keyword: PBEPBE/SDD
title: #p freq=noraman PBEPBE/SDD
converged: YES YES NO NO
title: Mulliken charges:
elementType: Cl O N N N C C C C C C C C C C C C C C C H H H H H H H H H H H H H H H H H H
charge: -0.035812 -0.289346 -0.087138 -0.349510 0.025147 -0.332706 -0.387872 0.277686 0.256247 -0.131002 0.475204 0.156618 -0.366475 -0.853535 -0.585187 -0.375163 -0.618170 -0.616484 -0.239570 -0.226816 0.180442 0.249209 0.254611 0.217850 0.349486 0.259147 0.328045 0.227645 0.228591 0.259800 0.234665 0.186788 0.219999 0.226110 0.188718 0.219616 0.235235 0.237927
chargesum: 0.00000
title: Mulliken charges with hydrogens summed into heavy atoms:
elementType: Cl O N N N C C C C C C C C C C C C C C C
charge: -0.035812 -0.289346 -0.087138 -0.000024 0.025147 0.096945 0.084589 0.277686 0.256247 -0.131002 0.475204 0.156618 -0.107328 -0.069255 -0.585187 -0.115364 0.023283 0.017960 -0.004335 0.011111
polarizability: 3.11876143e+02 7.43790195e+00 2.18677840e+02 -1.72344700e+01 -1.17993115e+00 1.06315430e+02
1716.lowfreq: -17.6149 -5.6130 -4.3155 -0.0003 0.0001 0.0015 9.8675 24.2659 25.3275
frequency: -10.2774 24.1488 25.2742 61.5880 63.1761 85.3938 119.6025 126.0849 134.0828 171.8976 177.2476 205.1430 212.7331 215.8893 229.8003 263.4096 270.3411 340.0136 345.0687 348.7575 362.1071 365.6766 403.0050 416.2690 427.3212 472.0218 487.0653 505.5930 568.6041 595.2239 598.6486 643.6175 653.4884 694.9621 727.3783 752.3251 757.2049 777.8302 795.9071 799.1882 827.3821 859.7850 886.6573 919.6986 975.6770 996.4277 1003.8410 1021.8950 1031.0064 1037.2642 1046.9948 1055.8909 1075.1342 1077.5954 1089.4554 1102.0031 1137.8714 1151.7224 1162.4075 1179.9090 1188.3605 1225.6830 1265.3719 1269.0581 1276.9413 1299.1592 1311.0987 1326.8253 1344.8536 1368.0199 1394.3344 1403.0350 1419.1749 1420.8083 1428.2043 1439.8203 1449.3910 1457.0692 1461.5630 1468.2485 1474.4292 1481.2622 1484.7586 1488.4453 1499.7133 1502.7660 1560.5673 1570.6543 1598.6355 1621.8085 2845.0336 2849.3625 2866.8650 2973.4390 3017.8769 3018.5397 3024.0119 3048.2445 3050.4402 3077.6285 3081.7477 3091.3559 3118.1421 3137.3233 3152.4773 3168.7262 3176.8589 3473.3022
redmass: 2.8432 4.9294 4.2112 6.0812 4.4912 2.4368 5.1814 3.5070 4.5781 1.0600 2.6697 4.3832 1.1668 4.6862 1.4712 4.2374 2.8582 8.6732 3.2292 3.6869 4.9206 3.9096 3.0159 2.6953 3.4508 5.0231 4.6275 4.4366 7.0568 4.1004 4.9505 5.0594 6.3827 5.4377 1.2145 1.8517 5.7641 1.3856 4.2526 2.6387 3.8677 2.7968 1.5072 6.4406 1.3653 3.0364 1.3348 2.6346 2.4455 1.5649 1.5246 2.5260 1.8570 2.5271 1.3604 2.5800 1.5020 2.7598 1.8387 1.3661 1.6000 2.2143 2.1678 2.1758 1.7522 1.1734 2.8580 1.3084 3.9702 1.3174 1.2780 6.6184 1.2715 2.3777 2.4936 1.1526 1.1955 1.2905 1.0581 1.0706 1.0543 1.0965 1.2290 1.5814 2.9660 1.0519 5.0811 8.1339 7.6442 6.4635 1.0573 1.0644 1.0632 1.0393 1.0701 1.0638 1.0702 1.0967 1.0881 1.1007 1.1004 1.1046 1.0977 1.0863 1.0898 1.0945 1.0994 1.0776
irintensity: 0.9011 1.2903 0.4125 5.1817 1.0454 0.9586 2.8857 1.9602 1.1651 0.8969 1.2161 0.8549 1.4824 0.7993 0.3557 0.7062 5.1773 5.7405 8.2482 7.2842 10.1932 2.2691 8.3010 0.7855 6.9838 0.3463 19.5647 8.6862 2.0135 3.5186 5.6108 3.6485 30.2902 12.1078 73.7481 15.6983 20.1901 75.7425 10.3057 12.6239 8.5238 10.8614 0.3442 64.2980 1.5911 30.1741 0.0473 4.4568 14.2318 23.3609 2.2532 60.8699 28.6219 7.4478 10.9778 3.2421 2.5324 5.0710 6.6815 2.9785 4.6377 11.4965 5.5165 27.4284 21.5317 16.7783 87.1462 1.4090 9.5030 1.8329 55.5059 2.7991 15.3239 5.4802 18.9409 5.1946 24.0687 29.4012 16.8306 30.3656 35.2130 21.0367 57.5458 296.6727 51.1532 18.5250 19.0265 48.2168 147.9936 6.1263 73.0603 82.0655 220.6139 35.0490 43.5904 15.1217 79.7949 15.9965 6.8518 16.5463 64.2290 19.8276 14.6600 4.0652 9.0851 8.0009 20.6991 83.2965
temp: 298.150 k
press: 1.00000 atm
elementType: 17 8 7 7 7 6 6 6 6 6 6 6 6 6 6 6 6 6 6 6 1 1 1 1 1 1 1 1 1 1 1 1 1 1 1 1 1 1
symmnumber: 1
zpe: 798705.6 jmol-1
zpe.correction: 0.304211 hartree
zpe.thermalcorrener: 0.323256 hartree
zpe.thermalcorrenthalpy: 0.324200 hartree
zpe.thermalcorrgfe: 0.255552 hartree
zpe.sumelectzpe: -1280.475284 hartree
zpe.sumelectthermal: -1280.456239 hartree
zpe.sumelectthermalent: -1280.455295 hartree
zpe.sumelectthermalfe: -1280.523943 hartree
dipole: -2.9518 0.2196 1.3387
dipole: 3.2486
quadrupole: -98.0648 -126.6407 -128.6039
quadrupole: 14.2972 2.0491 -3.0740
quadrupole: 19.7050 -8.8709 -10.8341 14.2972 2.0491 -3.0740
hfenergy: -1280.7794953 hartree
pointgroup: C01 [X(C15H18Cl1N3O1)]
dipole: -1.1680163 -0.4428649 -0.2703787 debye
polarizability: 312.6904129|6.145453|159.1384282|13.3883864|-56.2335531|165.0405706 unknown
InChI: InChI=1S/C15H18ClN3O/c1-10-11-6-4-5-7-12(11)14(16)18-13(10)15(20)17-8-9-19(2)3/h4-7,17H,8-9H2,1-3H3
charge 0 multiplicity 1
38 atoms
Cl -1.843207 -2.082729 2.858093
O  1.659759 1.918186 -0.568228
N  5.695422 -0.020498 0.239266
N  2.020935 0.383091 1.143072
N  -0.474993 -0.328849 1.337896
C  4.23349 -0.207219 0.121944
C  3.469083 0.609319 1.198462
C  -1.312949 1.201775 -0.379689
C  -2.651378 0.693693 -0.119891
C  -0.255669 0.659484 0.374858
C  -2.8660 -0.332611 0.882096
C  1.210532 1.053597 0.256674
C  -3.797464 1.178322 -0.830968
C  -1.118421 2.276116 -1.43057
C  -1.682944 -0.779932 1.564086
C  -4.17871 -0.831213 1.137658
C  6.410011 -0.165924 -1.044212
C  6.304735 -0.835198 1.308157
C  -5.076068 0.678052 -0.567068
C  -5.270837 -0.332702 0.422349
H  3.935235 -1.284552 0.191416
H  3.905244 0.16178 -0.865801
H  3.673431 1.679057 1.022552
H  3.822379 0.347958 2.211772
H  1.552145 -0.302862 1.745764
H  -3.666921 1.952666 -1.591775
H  -0.057728 2.549373 -1.509712
H  -1.471841 1.924505 -2.418719
H  -1.702757 3.180814 -1.175581
H  -4.31053 -1.605458 1.899313
H  5.981176 0.526839 -1.789103
H  6.367481 -1.202375 -1.466848
H  7.474561 0.098446 -0.906625
H  7.369218 -0.56233 1.422634
H  6.248784 -1.936257 1.106685
H  5.80585 -0.641941 2.273815
H  -5.937778 1.063423 -1.122778
H  -6.277876 -0.715344 0.618706
