program: Orca
programVersion: 5.0.2
elementType: S F F F F O O N N N C C C C C C C C C C C C C C H H H H H H H H H H H H H
charge: 0
multiplicity: 1
keywords: wb97x-d3
keywords: def2-TZVPP
keywords: def2/J RIJCOSX
keywords: DEFGRID2
keywords: scfconv7
keywords: smallprint printgap noloewdin
keywords: NOSOSCF
formula: C14H13F4N3O2S
InChI: InChI=1/C14H13F4N3O2S/c1-8(2)21(10-5-3-9(15)4-6-10)11(22)7-23-13-20-19-12(24-13)14(16,17)18/h3-6,8H,7H2,1-2H3
37 atoms
S  2.482514 2.325352 -1.059249
F  -3.037317 -5.370559 -1.850365
F  5.498299 2.099274 0.167789
F  4.295956 3.587074 1.142087
F  4.716134 1.721044 2.139174
O  0.321424 0.988475 -1.705408
O  -1.339122 1.672589 0.221723
N  -2.418919 -0.323908 0.285785
N  1.493819 0.328068 0.190824
N  2.590164 0.683319 0.881069
C  -3.24307 0.032344 1.456527
C  -2.568889 -1.625482 -0.272053
C  -2.821817 -0.757176 2.686753
C  -4.727079 -0.129303 1.168892
C  -1.517707 0.543103 -0.210448
C  -0.706752 0.049896 -1.405142
C  -1.815201 -2.688007 0.215377
C  -3.482419 -1.841959 -1.297348
C  -1.967508 -3.959039 -0.315754
C  -3.64664 -3.108466 -1.836621
C  -2.884358 -4.14375 -1.332493
C  1.298967 1.085022 -0.839648
C  3.207433 1.685653 0.369784
C  4.443446 2.2725 0.966517
H  -3.048721 1.086453 1.643841
H  -1.758529 -0.636467 2.895539
H  -3.37461 -0.396819 3.554916
H  -3.035655 -1.821873 2.582674
H  -5.034107 0.44132 0.292301
H  -5.295844 0.242039 2.021754
H  -5.008503 -1.172413 1.018829
H  -0.281459 -0.941444 -1.246566
H  -1.333081 0.011887 -2.296733
H  -1.093069 -2.520453 1.003386
H  -4.068475 -1.017516 -1.68108
H  -1.380166 -4.788664 0.054701
H  -4.355709 -3.283503 -2.634682
elementType: S F O N C H
totalener: -1653.74326879 hartree
nucrepener: 2265.32086491 hartree
electener: -3919.06413370 hartree
oneelecener: -6776.99409121 hartree
twoeener: 2857.92995751 hartree
cpcmener: -0.03393738 hartree
kineticenergy: 1648.38713591 hartree
xcener: -131.222971006883 hartree
chargesum: 0.0000000
charge: 0.089911 -0.220132 -0.165152 -0.166457 -0.154775 -0.278001 -0.534900 -0.029569 -0.211337 -0.196321 0.155988 0.065031 -0.304469 -0.313187 0.303754 0.051533 -0.264508 -0.256727 -0.125394 -0.123719 0.287275 0.286645 0.014890 0.486266 0.071118 0.101489 0.106333 0.091564 0.103533 0.107639 0.096865 0.142730 0.157103 0.158189 0.157767 0.154976 0.154047
qa: 0.0899 -0.2201 -0.1652 -0.1665 -0.1548 -0.2780 -0.5349 -0.0296 -0.2113 -0.1963 0.1560 0.0650 -0.3045 -0.3132 0.3038 0.0515 -0.2645 -0.2567 -0.1254 -0.1237 0.2873 0.2866 0.0149 0.4863 0.0711 0.1015 0.1063 0.0916 0.1035 0.1076 0.0969 0.1427 0.1571 0.1582 0.1578 0.1550 0.1540
va: 2.7205 1.0596 1.1364 1.1365 1.1588 2.1547 1.9761 3.0188 2.9010 3.0378 3.7583 3.5325 3.9319 3.9382 4.1024 3.7994 3.9804 3.9966 3.8464 3.8381 3.9367 4.1675 4.0325 4.5126 1.0384 1.0058 1.0069 0.9993 1.0045 1.0060 0.9948 1.0011 0.9954 1.0057 1.0034 0.9962 0.9966
dispcorr: -0.018396505 hartree
energy: -1653.761665293431
dipole: -47.82441 45.71063 -2.11379 -15.77948 14.53780 -1.24168 5.50413 -6.80628 -1.30215
magnitude: 2.77587 au
magnitude: 7.05570 debye
