program: Orca
programVersion: 5.0.2
elementType: Cl O O N N N N N C C C C C C C C C C C C C C C C H H H H H H H H H H H H H H H H H H H H
charge: 0
multiplicity: 1
keywords: wb97x-d3
keywords: def2-TZVPP
keywords: def2/J RIJCOSX
keywords: DEFGRID2
keywords: scfconv7
keywords: smallprint printgap noloewdin
keywords: NOSOSCF
formula: C16H20ClN5O2
InChI: InChI=1/C16H20ClN5O2/c1-2-20(12-8-4-3-5-9-12)15(23)22-16(24)21(18-19-22)14-11-7-6-10-13(14)17/h6-7,10-12H,2-5,8-9H2,1H3
44 atoms
Cl 1.18551 2.474184 -0.406114
O  -0.845681 -3.508375 0.352777
O  0.850884 -0.635037 -1.452189
N  -2.142106 -1.718168 -0.181474
N  0.050062 -1.430182 0.597361
N  1.788572 -0.244707 0.652479
N  0.493657 -1.381613 1.864902
N  1.516583 -0.666045 1.899651
C  -2.394232 -0.268091 -0.135219
C  -2.541992 0.335604 -1.530332
C  -3.604152 0.062857 0.73707
C  -2.742052 1.845433 -1.436534
C  -3.796283 1.574089 0.825335
C  -3.933145 2.200903 -0.55634
C  -3.223951 -2.600079 -0.631252
C  -1.033666 -2.313556 0.243467
C  -3.984315 -3.290621 0.488027
C  0.88325 -0.746174 -0.247078
C  2.918769 0.54077 0.355353
C  2.762973 1.818556 -0.172275
C  4.188455 0.034063 0.587151
C  3.875554 2.581161 -0.48722
C  5.301609 0.803199 0.293626
C  5.14235 2.06914 -0.251868
H  -1.532262 0.202054 0.338799
H  -3.401155 -0.106717 -2.04348
H  -1.660214 0.109225 -2.130657
H  -3.467591 -0.35818 1.735534
H  -4.508729 -0.386527 0.316273
H  -2.870881 2.258787 -2.438847
H  -1.837577 2.305802 -1.025161
H  -2.941879 2.01918 1.34555
H  -4.677193 1.791702 1.432596
H  -4.028844 3.285506 -0.471097
H  -4.853461 1.841279 -1.027959
H  -3.909098 -1.995841 -1.221815
H  -2.804805 -3.339601 -1.314262
H  -3.348548 -3.950275 1.075276
H  -4.452361 -2.576326 1.163536
H  -4.775517 -3.900238 0.050835
H  4.296867 -0.96231 0.994371
H  3.753699 3.571627 -0.903133
H  6.290564 0.408076 0.478799
H  6.007938 2.670222 -0.494382
elementType: Cl O N C H
totalener: -1506.26685055 hartree
nucrepener: 2335.88982298 hartree
electener: -3842.15667353 hartree
oneelecener: -6701.21504504 hartree
twoeener: 2859.05837150 hartree
cpcmener: -0.03851765 hartree
kineticenergy: 1501.16448307 hartree
xcener: -121.907570156478 hartree
chargesum: -0.0000000
charge: -0.069975 -0.491737 -0.495430 -0.073036 0.034311 0.037618 -0.127659 -0.116567 0.073530 -0.178632 -0.167438 -0.140616 -0.150603 -0.125578 -0.058192 0.360592 -0.262225 0.336923 0.163438 -0.035164 -0.186401 -0.092144 -0.094968 -0.154689 0.082666 0.090215 0.085496 0.088864 0.084689 0.078769 0.069518 0.071796 0.078535 0.078408 0.065283 0.110664 0.104203 0.087730 0.092838 0.102162 0.160951 0.149240 0.166057 0.166554
qa: -0.0700 -0.4917 -0.4954 -0.0730 0.0343 0.0376 -0.1277 -0.1166 0.0735 -0.1786 -0.1674 -0.1406 -0.1506 -0.1256 -0.0582 0.3606 -0.2622 0.3369 0.1634 -0.0352 -0.1864 -0.0921 -0.0950 -0.1547 0.0827 0.0902 0.0855 0.0889 0.0847 0.0788 0.0695 0.0718 0.0785 0.0784 0.0653 0.1107 0.1042 0.0877 0.0928 0.1022 0.1610 0.1492 0.1661 0.1666
va: 1.2623 2.0215 2.0167 3.2348 3.1591 3.2329 2.8454 2.8404 3.8528 3.8897 3.9140 3.9136 3.9227 3.8929 3.8498 4.3083 3.9016 4.3674 3.5552 4.0352 4.0206 3.9199 3.8721 3.9284 1.0162 1.0164 1.0345 1.0141 1.0056 1.0129 1.0065 1.0103 1.0113 1.0097 1.0117 1.0026 1.0090 1.0146 1.0019 1.0041 1.0029 1.0023 0.9876 0.9864
dispcorr: -0.024990714 hartree
energy: -1506.291841264975
dipole: -34.39737 34.11373 -0.28364 -0.90040 2.98550 2.08510 -3.75241 3.63883 -0.11357
magnitude: 2.10737 au
magnitude: 5.35651 debye
