program: Orca
programVersion: 5.0.2
elementType: Cl O O N N N N N C C C C C C C C C C C C C C C C H H H H H H H H H H H H H H H H H H H H
charge: 0
multiplicity: 1
keywords: wb97x-d3
keywords: def2-TZVPP
keywords: def2/J RIJCOSX
keywords: DEFGRID2
keywords: scfconv7
keywords: smallprint printgap noloewdin
keywords: NOSOSCF
formula: C16H20ClN5O2
InChI: InChI=1/C16H20ClN5O2/c1-2-20(12-8-4-3-5-9-12)15(23)22-16(24)21(18-19-22)14-11-7-6-10-13(14)17/h6-7,10-12H,2-5,8-9H2,1H3
44 atoms
Cl 4.156285 -1.329143 0.563388
O  -1.226303 -3.146868 -0.242053
O  0.297656 0.16014 -1.572699
N  -2.494541 -1.276919 -0.50453
N  -0.293412 -1.13916 0.282015
N  1.474111 -0.001575 0.441541
N  0.273369 -1.390948 1.474673
N  1.307889 -0.702662 1.577227
C  -2.771741 0.114703 -0.122046
C  -3.216044 0.962414 -1.310359
C  -3.77538 0.181327 1.029584
C  -3.444962 2.406504 -0.872974
C  -4.003975 1.629999 1.45107
C  -4.444894 2.491556 0.274123
C  -3.567151 -2.051583 -1.133886
C  -1.393659 -1.949246 -0.175943
C  -3.302731 -2.337879 -2.600708
C  0.466829 -0.264601 -0.453494
C  2.577659 0.846022 0.232101
C  3.87609 0.345633 0.271228
C  2.358584 2.186891 -0.047824
C  4.952353 1.19237 0.06199
C  3.433073 3.028359 -0.281965
C  4.726224 2.531209 -0.217995
H  -1.846599 0.549913 0.253006
H  -4.144005 0.568188 -1.736147
H  -2.459432 0.920161 -2.096409
H  -3.398864 -0.404221 1.872064
H  -4.730005 -0.263747 0.732593
H  -3.791382 2.994176 -1.72587
H  -2.491875 2.846931 -0.560811
H  -3.077766 2.035464 1.872352
H  -4.747011 1.664993 2.250919
H  -4.56743 3.52966 0.592177
H  -5.427182 2.155258 -0.074809
H  -3.718922 -2.979404 -0.581766
H  -4.488956 -1.48359 -1.032259
H  -3.175383 -1.416472 -3.169093
H  -2.41487 -2.952674 -2.745368
H  -4.150031 -2.877896 -3.024851
H  1.346323 2.568297 -0.073424
H  5.960961 0.805032 0.105158
H  3.258243 4.072142 -0.503208
H  5.570253 3.18531 -0.390519
elementType: Cl O N C H
totalener: -1506.27467961 hartree
nucrepener: 2294.53482868 hartree
electener: -3800.80950829 hartree
oneelecener: -6618.33119480 hartree
twoeener: 2817.52168651 hartree
cpcmener: -0.03300934 hartree
kineticenergy: 1501.17020679 hartree
xcener: -121.905989742451 hartree
chargesum: 0.0000000
charge: -0.056730 -0.454782 -0.475216 -0.076103 0.030145 0.024657 -0.126332 -0.121424 0.030274 -0.144564 -0.162619 -0.147904 -0.146451 -0.126443 -0.059752 0.342491 -0.259040 0.336424 0.189107 -0.035569 -0.202672 -0.100035 -0.102075 -0.145967 0.089245 0.082875 0.084489 0.084252 0.084594 0.077917 0.073272 0.072401 0.078241 0.079430 0.063139 0.103680 0.105679 0.091586 0.090693 0.098491 0.163307 0.142967 0.161588 0.162734
qa: -0.0567 -0.4548 -0.4752 -0.0761 0.0301 0.0247 -0.1263 -0.1214 0.0303 -0.1446 -0.1626 -0.1479 -0.1465 -0.1264 -0.0598 0.3425 -0.2590 0.3364 0.1891 -0.0356 -0.2027 -0.1000 -0.1021 -0.1460 0.0892 0.0829 0.0845 0.0843 0.0846 0.0779 0.0733 0.0724 0.0782 0.0794 0.0631 0.1037 0.1057 0.0916 0.0907 0.0985 0.1633 0.1430 0.1616 0.1627
va: 1.2622 2.0678 2.0477 3.1678 3.1470 3.2361 2.8412 2.8198 3.8990 3.8815 3.9098 3.9230 3.9048 3.8862 3.8452 4.3269 3.9242 4.3608 3.5487 4.0790 4.0213 3.9325 3.8936 3.9233 1.0111 1.0090 1.0266 1.0209 1.0148 1.0112 1.0109 1.0086 1.0120 1.0098 1.0113 1.0129 1.0021 1.0014 1.0092 1.0054 1.0007 1.0062 0.9894 0.9874
dispcorr: -0.023902024 hartree
energy: -1506.298581629640
dipole: -45.60594 44.58636 -1.01958 16.60120 -13.61638 2.98482 -9.17307 9.09889 -0.07418
magnitude: 3.15502 au
magnitude: 8.01943 debye
