program: Orca
programVersion: 5.0.2
elementType: Cl O O N N N N N C C C C C C C C C C C C C C C C H H H H H H H H H H H H H H H H H H H H
charge: 0
multiplicity: 1
keywords: wb97x-d3
keywords: def2-TZVPP
keywords: def2/J RIJCOSX
keywords: DEFGRID2
keywords: scfconv7
keywords: smallprint printgap noloewdin
keywords: NOSOSCF
formula: C16H20ClN5O2
InChI: InChI=1/C16H20ClN5O2/c1-2-20(12-8-4-3-5-9-12)15(23)22-16(24)21(18-19-22)14-11-7-6-10-13(14)17/h6-7,10-12H,2-5,8-9H2,1H3
44 atoms
Cl 1.194246 2.317778 -0.730061
O  -1.081792 -3.33955 1.082429
O  0.798326 -0.847989 -1.315061
N  -2.129896 -1.726532 -0.140195
N  -0.028868 -1.336209 0.823944
N  1.767551 -0.232129 0.721509
N  0.435349 -1.149579 2.074328
N  1.48539 -0.481295 2.017339
C  -2.303966 -0.27917 -0.33537
C  -3.197153 0.055384 -1.52551
C  -2.801874 0.430565 0.92573
C  -3.21151 1.565855 -1.750233
C  -2.830541 1.940532 0.708237
C  -3.674816 2.313184 -0.504978
C  -3.197779 -2.660185 -0.481576
C  -1.134045 -2.236559 0.608212
C  -4.306613 -2.753667 0.554801
C  0.836103 -0.811086 -0.115278
C  2.898552 0.5061 0.340017
C  2.757291 1.696966 -0.36515
C  4.164579 0.050314 0.676087
C  3.879706 2.41212 -0.751352
C  5.285175 0.775289 0.311747
C  5.139836 1.949749 -0.41098
H  -1.333486 0.142352 -0.594874
H  -4.22356 -0.284179 -1.351735
H  -2.830668 -0.451993 -2.420633
H  -2.160043 0.18903 1.776459
H  -3.803857 0.073687 1.181944
H  -3.857397 1.802373 -2.5981
H  -2.205813 1.898819 -2.026975
H  -1.806049 2.30091 0.565829
H  -3.208041 2.437539 1.603892
H  -3.637266 3.391202 -0.676041
H  -4.723634 2.068714 -0.305541
H  -3.604849 -2.373524 -1.449311
H  -2.746085 -3.640642 -0.619935
H  -3.908686 -3.023009 1.531874
H  -4.857618 -1.818476 0.652659
H  -5.02032 -3.524117 0.261767
H  4.258435 -0.87485 1.228463
H  3.761615 3.332627 -1.305255
H  6.26898 0.41701 0.580451
H  6.011179 2.516515 -0.709282
totalener: -1506.24730082 hartree
nucrepener: 2350.79754828 hartree
electener: -3857.04484911 hartree
oneelecener: -6730.64384055 hartree
twoeener: 2873.59899144 hartree
kineticenergy: 1501.21245720 hartree
xcener: -121.909676219794 hartree
chargesum: -0.0000000
charge: -0.062065 -0.346701 -0.357543 -0.097148 0.023215 0.003485 -0.104334 -0.103810 0.061660 -0.170867 -0.164927 -0.166906 -0.157829 -0.114003 -0.064983 0.313146 -0.254263 0.233391 0.163948 0.003074 -0.162105 -0.094775 -0.076748 -0.130230 0.052349 0.077645 0.097210 0.089404 0.084608 0.079033 0.075035 0.069856 0.078320 0.078363 0.060798 0.094564 0.101946 0.104637 0.069891 0.092068 0.131319 0.124567 0.132837 0.132866
qa: -0.0621 -0.3467 -0.3575 -0.0971 0.0232 0.0035 -0.1043 -0.1038 0.0617 -0.1709 -0.1649 -0.1669 -0.1578 -0.1140 -0.0650 0.3131 -0.2543 0.2334 0.1639 0.0031 -0.1621 -0.0948 -0.0767 -0.1302 0.0523 0.0776 0.0972 0.0894 0.0846 0.0790 0.0750 0.0699 0.0783 0.0784 0.0608 0.0946 0.1019 0.1046 0.0699 0.0921 0.1313 0.1246 0.1328 0.1329
va: 1.2648 2.1715 2.1600 3.1538 3.1393 3.1735 2.8299 2.7916 3.8086 3.9201 3.8785 3.9375 3.9232 3.8645 3.8939 4.3357 3.8976 4.4496 3.6477 4.0566 4.0745 3.9796 3.9367 3.9777 1.0351 1.0050 1.0131 1.0291 1.0138 1.0129 1.0142 1.0201 1.0160 1.0129 1.0129 0.9964 1.0163 1.0091 1.0055 1.0113 1.0144 1.0109 0.9998 0.9984
dispcorr: -0.025473699 hartree
energy: -1506.272774521047
dipole: -33.39418 33.44297 0.04879 0.58138 0.77242 1.35380 -4.24144 3.63831 -0.60313
magnitude: 1.48288 au
magnitude: 3.76917 debye
