program: Orca
programVersion: 5.0.2
elementType: Cl O O N N N N N C C C C C C C C C C C C C C C C H H H H H H H H H H H H H H H H H H H H
charge: 0
multiplicity: 1
keywords: wb97x-d3
keywords: def2-TZVPP
keywords: def2/J RIJCOSX
keywords: DEFGRID2
keywords: scfconv7
keywords: smallprint printgap noloewdin
keywords: NOSOSCF
formula: C16H20ClN5O2
InChI: InChI=1/C16H20ClN5O2/c1-2-20(12-8-4-3-5-9-12)15(23)22-16(24)21(18-19-22)14-11-7-6-10-13(14)17/h6-7,10-12H,2-5,8-9H2,1H3
44 atoms
Cl 2.311873 -0.097907 -2.537015
O  -1.312882 0.340208 3.119279
O  0.908765 1.918178 1.506419
N  -2.616752 -0.142225 1.321732
N  -0.278152 -0.070941 1.134379
N  1.702794 0.014712 0.403624
N  0.024774 -1.251258 0.551295
N  1.19117 -1.196819 0.117156
C  -2.794158 -0.19197 -0.129971
C  -3.503464 -1.469456 -0.574323
C  -3.496872 1.061566 -0.656371
C  -3.648967 -1.508212 -2.09275
C  -3.638079 1.00288 -2.174847
C  -4.359407 -0.265296 -2.617184
C  -3.80358 -0.181808 2.173581
C  -1.450568 0.072007 1.955427
C  -3.954468 -1.496017 2.922346
C  0.793783 0.79825 1.096884
C  3.006426 0.384907 0.036409
C  3.410449 0.361232 -1.29577
C  3.890673 0.814586 1.015694
C  4.702156 0.730635 -1.634834
C  5.172271 1.207262 0.673451
C  5.579285 1.155231 -0.650623
H  -1.8057 -0.208496 -0.586482
H  -4.498658 -1.527518 -0.12083
H  -2.939358 -2.334716 -0.219715
H  -2.930283 1.946726 -0.357251
H  -4.492014 1.160496 -0.21095
H  -4.188101 -2.410621 -2.387971
H  -2.656525 -1.580874 -2.549959
H  -2.644472 1.034017 -2.634833
H  -4.166636 1.889556 -2.530637
H  -4.429276 -0.300586 -3.706473
H  -5.388438 -0.247961 -2.242171
H  -3.771369 0.651259 2.875976
H  -4.673137 -0.018198 1.539042
H  -4.863896 -1.477636 3.523498
H  -4.022299 -2.339934 2.236469
H  -3.117062 -1.667331 3.596165
H  3.565918 0.841343 2.046688
H  5.009941 0.698281 -2.670462
H  5.852642 1.545321 1.442311
H  6.582834 1.450846 -0.924569
totalener: -1506.24785759 hartree
nucrepener: 2283.78752818 hartree
electener: -3790.03538576 hartree
oneelecener: -6596.75743414 hartree
twoeener: 2806.72204838 hartree
kineticenergy: 1501.21246677 hartree
xcener: -121.907345139880 hartree
chargesum: -0.0000000
charge: -0.049158 -0.349127 -0.353882 -0.110735 0.005261 -0.016382 -0.124518 -0.108774 0.011682 -0.151067 -0.160726 -0.153508 -0.142950 -0.123891 -0.076291 0.331455 -0.245779 0.290205 0.198944 -0.042116 -0.163585 -0.088811 -0.081141 -0.130375 0.079237 0.069904 0.096161 0.089469 0.074461 0.076521 0.076149 0.071718 0.078073 0.080583 0.060152 0.109863 0.087500 0.086959 0.080424 0.101731 0.132315 0.120078 0.132683 0.131287
qa: -0.0492 -0.3491 -0.3539 -0.1107 0.0053 -0.0164 -0.1245 -0.1088 0.0117 -0.1511 -0.1607 -0.1535 -0.1430 -0.1239 -0.0763 0.3315 -0.2458 0.2902 0.1989 -0.0421 -0.1636 -0.0888 -0.0811 -0.1304 0.0792 0.0699 0.0962 0.0895 0.0745 0.0765 0.0761 0.0717 0.0781 0.0806 0.0602 0.1099 0.0875 0.0870 0.0804 0.1017 0.1323 0.1201 0.1327 0.1313
va: 1.2699 2.1664 2.1784 3.1430 3.1104 3.1893 2.8037 2.8014 3.9035 3.8865 3.9016 3.9204 3.8989 3.8740 3.8800 4.3257 3.9215 4.3978 3.6249 4.1238 4.0726 3.9674 3.9485 3.9720 1.0276 1.0085 1.0216 1.0237 1.0174 1.0132 1.0117 1.0122 1.0139 1.0115 1.0134 1.0130 1.0016 1.0081 1.0038 1.0107 1.0137 1.0140 0.9997 0.9986
dispcorr: -0.023112146 hartree
energy: -1506.270969731768
dipole: -39.57648 39.31376 -0.26272 -3.68636 3.42420 -0.26216 -0.45447 -0.66661 -1.12109
magnitude: 1.18092 au
magnitude: 3.00167 debye
