program: Orca
programVersion: 5.0.2
elementType: Cl O O N N N N N C C C C C C C C C C C C C C C C H H H H H H H H H H H H H H H H H H H H
charge: 0
multiplicity: 1
keywords: wb97x-d3
keywords: def2-TZVPP
keywords: def2/J RIJCOSX
keywords: DEFGRID2
keywords: scfconv7
keywords: smallprint printgap noloewdin
keywords: NOSOSCF
formula: C16H20ClN5O2
InChI: InChI=1/C16H20ClN5O2/c1-2-20(12-8-4-3-5-9-12)15(23)22-16(24)21(18-19-22)14-11-7-6-10-13(14)17/h6-7,10-12H,2-5,8-9H2,1H3
44 atoms
Cl 3.160153 -1.610365 -1.275254
O  -1.57555 0.38716 1.953927
O  1.250678 -1.012369 1.360168
N  -2.306702 0.053735 -0.185545
N  -0.073177 0.576955 0.254733
N  2.020139 0.786488 0.08083
N  0.194005 1.67686 -0.476856
N  1.4307 1.797508 -0.5836
C  -3.707725 -0.062995 0.221901
C  -4.572581 1.025594 -0.413478
C  -4.281855 -1.454729 -0.039367
C  -6.0107 0.928845 0.087566
C  -5.720586 -1.541343 0.4628
C  -6.594491 -0.458039 -0.159434
C  -1.949529 -0.233927 -1.572371
C  -1.397031 0.325509 0.767453
C  -1.275802 -1.583135 -1.773549
C  1.086598 -0.035867 0.68764
C  3.416983 0.665502 0.15886
C  4.06083 -0.426066 -0.414537
C  4.156388 1.638056 0.815012
C  5.437872 -0.548227 -0.315712
C  5.533093 1.528001 0.897531
C  6.169136 0.429687 0.33817
H  -3.72095 0.095115 1.301092
H  -4.56801 0.930599 -1.504969
H  -4.151832 2.006545 -0.181762
H  -3.66062 -2.205855 0.453693
H  -4.265448 -1.680793 -1.111507
H  -6.623251 1.693389 -0.394743
H  -6.035149 1.147808 1.160255
H  -5.729722 -1.435685 1.552554
H  -6.127417 -2.531585 0.247919
H  -7.609964 -0.5173 0.238045
H  -6.674516 -0.631589 -1.238151
H  -2.874597 -0.206505 -2.146592
H  -1.335847 0.568202 -1.980333
H  -0.317088 -1.650763 -1.261294
H  -1.901349 -2.398958 -1.413807
H  -1.090374 -1.746004 -2.83563
H  3.639963 2.479448 1.257337
H  5.931207 -1.402573 -0.75745
H  6.105147 2.290805 1.40706
H  7.243838 0.33012 0.407481
totalener: -1506.24717426 hartree
nucrepener: 2260.17207947 hartree
electener: -3766.41925373 hartree
oneelecener: -6549.63636508 hartree
twoeener: 2783.21711135 hartree
kineticenergy: 1501.21483829 hartree
xcener: -121.907797750234 hartree
chargesum: 0.0000000
charge: -0.049253 -0.344444 -0.342893 -0.131384 -0.003775 -0.006715 -0.120038 -0.110098 0.089087 -0.172677 -0.170964 -0.142515 -0.153118 -0.123194 -0.106050 0.333395 -0.239540 0.251680 0.170148 -0.021695 -0.157066 -0.091666 -0.079000 -0.127664 0.093387 0.069135 0.088904 0.096238 0.064047 0.075894 0.073853 0.076072 0.076095 0.079585 0.059320 0.094299 0.118886 0.090431 0.088950 0.088071 0.129818 0.122431 0.132008 0.132015
qa: -0.0493 -0.3444 -0.3429 -0.1314 -0.0038 -0.0067 -0.1200 -0.1101 0.0891 -0.1727 -0.1710 -0.1425 -0.1531 -0.1232 -0.1061 0.3334 -0.2395 0.2517 0.1701 -0.0217 -0.1571 -0.0917 -0.0790 -0.1277 0.0934 0.0691 0.0889 0.0962 0.0640 0.0759 0.0739 0.0761 0.0761 0.0796 0.0593 0.0943 0.1189 0.0904 0.0890 0.0881 0.1298 0.1224 0.1320 0.1320
va: 1.2717 2.1720 2.1789 3.1281 3.1239 3.1672 2.8311 2.8198 3.7574 3.9293 3.9265 3.9003 3.9259 3.8765 3.8814 4.3294 3.9309 4.4340 3.6457 4.0893 4.0784 3.9724 3.9399 3.9728 1.0485 1.0173 1.0209 1.0120 1.0085 1.0132 1.0118 1.0120 1.0131 1.0114 1.0130 1.0022 1.0132 1.0072 1.0050 1.0098 1.0132 1.0119 1.0000 0.9985
dispcorr: -0.023437083 hartree
energy: -1506.270611343676
dipole: -45.92850 45.91739 -0.01111 -2.32973 2.48223 0.15251 -3.88433 2.71431 -1.17003
magnitude: 1.17998 au
magnitude: 2.99926 debye
