program: Orca
programVersion: 5.0.2
elementType: Cl O O N N N N N C C C C C C C C C C C C C C C C H H H H H H H H H H H H H H H H H H H H
charge: 0
multiplicity: 1
keywords: wb97x-d3
keywords: def2-TZVPP
keywords: def2/J RIJCOSX
keywords: DEFGRID2
keywords: scfconv7
keywords: smallprint printgap noloewdin
keywords: NOSOSCF
formula: C16H20ClN5O2
InChI: InChI=1/C16H20ClN5O2/c1-2-20(12-8-4-3-5-9-12)15(23)22-16(24)21(18-19-22)14-11-7-6-10-13(14)17/h6-7,10-12H,2-5,8-9H2,1H3
44 atoms
Cl 4.254401 -1.253784 -0.115351
O  -1.130491 -3.053144 -0.988084
O  0.234309 0.57318 -1.507962
N  -2.472244 -1.236656 -0.763391
N  -0.230885 -1.190279 -0.034921
N  1.531935 -0.083302 0.321208
N  0.421258 -1.737025 1.01229
N  1.448919 -1.071509 1.23686
C  -2.747883 0.077563 -0.1838
C  -3.012923 1.1476 -1.242719
C  -3.88429 0.034491 0.838615
C  -3.175243 2.513477 -0.582593
C  -4.049624 1.400912 1.499118
C  -4.279787 2.500364 0.468133
C  -3.546125 -1.930028 -1.471673
C  -1.320532 -1.918239 -0.640198
C  -4.243144 -3.014173 -0.6627
C  0.473784 -0.129003 -0.560529
C  2.593363 0.836987 0.299976
C  3.905607 0.410876 0.117781
C  2.32039 2.189864 0.435908
C  4.937194 1.336554 0.106944
C  3.347576 3.115901 0.402562
C  4.65608 2.685034 0.247116
H  -1.857096 0.38039 0.366668
H  -3.927899 0.911922 -1.796769
H  -2.194252 1.162124 -1.960903
H  -3.679156 -0.729703 1.592016
H  -4.823776 -0.243812 0.349512
H  -3.381608 3.268838 -1.343305
H  -2.226637 2.802013 -0.116626
H  -3.15102 1.63014 2.08225
H  -4.875182 1.368453 2.212977
H  -4.347053 3.472171 0.962128
H  -5.244461 2.337762 -0.024145
H  -4.26861 -1.177098 -1.783973
H  -3.135991 -2.360859 -2.38549
H  -5.029573 -3.466721 -1.267584
H  -3.550877 -3.80201 -0.375738
H  -4.7075 -2.615862 0.238423
H  1.296327 2.510886 0.567777
H  5.954754 0.997316 -0.024873
H  3.126993 4.168827 0.504661
H  5.466737 3.400675 0.229145
totalener: -1506.24802235 hartree
nucrepener: 2293.19497608 hartree
electener: -3799.44299842 hartree
oneelecener: -6615.45414322 hartree
twoeener: 2816.01114479 hartree
kineticenergy: 1501.21481016 hartree
xcener: -121.908430510451 hartree
chargesum: 0.0000000
charge: -0.031916 -0.352599 -0.387112 -0.089616 0.010058 -0.005299 -0.098062 -0.101989 0.006778 -0.156184 -0.166736 -0.146940 -0.155483 -0.119040 -0.071964 0.320539 -0.247499 0.267268 0.198626 -0.041322 -0.154278 -0.092566 -0.088832 -0.122312 0.074264 0.076148 0.109816 0.090901 0.072352 0.076634 0.068527 0.070286 0.079024 0.078087 0.060929 0.091298 0.103079 0.087751 0.107876 0.076099 0.119833 0.120882 0.130478 0.132218
qa: -0.0319 -0.3526 -0.3871 -0.0896 0.0101 -0.0053 -0.0981 -0.1020 0.0068 -0.1562 -0.1667 -0.1469 -0.1555 -0.1190 -0.0720 0.3205 -0.2475 0.2673 0.1986 -0.0413 -0.1543 -0.0926 -0.0888 -0.1223 0.0743 0.0761 0.1098 0.0909 0.0724 0.0766 0.0685 0.0703 0.0790 0.0781 0.0609 0.0913 0.1031 0.0878 0.1079 0.0761 0.1198 0.1209 0.1305 0.1322
va: 1.2883 2.1669 2.1305 3.1578 3.1175 3.1908 2.8137 2.7760 3.9265 3.8548 3.9046 3.9056 3.9236 3.8737 3.8869 4.3364 3.8984 4.3849 3.6023 4.1453 4.0773 3.9657 3.9587 3.9623 1.0098 1.0161 1.0381 1.0155 1.0077 1.0143 1.0147 1.0115 1.0138 1.0124 1.0134 1.0021 1.0112 1.0082 1.0148 1.0044 1.0114 1.0150 1.0001 0.9982
dispcorr: -0.023907187 hartree
energy: -1506.271929532508
dipole: -47.76962 47.05494 -0.71468 15.22939 -13.24077 1.98863 -0.10836 0.50206 0.39370
magnitude: 2.14951 au
magnitude: 5.46363 debye
