program: Orca
programVersion: 5.0.2
elementType: Cl Cl S O O O O N C C C C C C C C C C C C C C H H H H H H H H H H H H H H H H H
charge: 0
multiplicity: 1
keywords: wb97x-d3
keywords: def2-TZVPP
keywords: def2/J RIJCOSX
keywords: DEFGRID2
keywords: scfconv7
keywords: smallprint printgap noloewdin
keywords: NOSOSCF
formula: C14H17Cl2NO4S
InChI: InChI=1/C14H17Cl2NO4S/c1-4-20-12-6-10(15)9(5-11(12)16)8-22(18,19)13-7-14(2,3)21-17-13/h5-6H,4,7-8H2,1-3H3
39 atoms
Cl 0.560079 -3.213547 1.498122
Cl -2.731403 0.847055 -1.834323
S  2.794129 -0.374044 0.146751
O  2.160557 2.895146 -1.707615
O  4.173356 -0.563729 -0.289871
O  2.468037 -0.469309 1.565227
O  -3.722883 -0.737525 0.327241
N  2.656466 1.671453 -1.48703
C  1.336947 3.347418 -0.568557
C  1.368422 2.149558 0.399948
C  2.247483 1.231585 -0.366646
C  -0.047983 3.63699 -1.10395
C  2.005664 4.578777 0.004434
C  1.756698 -1.50944 -0.796597
C  0.312968 -1.353592 -0.461491
C  -0.315789 -2.052588 0.56305
C  -0.46749 -0.458938 -1.191313
C  -1.800288 -0.265943 -0.9014
C  -1.657733 -1.878385 0.860368
C  -2.424499 -0.972442 0.133797
C  -4.427556 -1.39047 1.388254
C  -4.161011 -0.764337 2.738365
H  1.798096 2.405411 1.369844
H  0.380504 1.719348 0.577592
H  -0.692468 3.975701 -0.292555
H  -0.022771 4.422372 -1.860395
H  -0.50083 2.746965 -1.541603
H  1.433784 4.9434 0.857885
H  3.017156 4.358111 0.347482
H  2.053836 5.380898 -0.733052
H  2.149953 -2.504555 -0.576405
H  1.955189 -1.297439 -1.848361
H  -0.016638 0.089158 -2.008917
H  -2.094205 -2.458653 1.66075
H  -4.208961 -2.46123 1.388176
H  -5.477703 -1.278381 1.123849
H  -4.430533 0.291701 2.742241
H  -3.120893 -0.85625 3.050879
H  -4.774107 -1.267444 3.486418
elementType: Cl S O N C H
totalener: -2218.03660218 hartree
nucrepener: 2439.15099534 hartree
electener: -4657.18759752 hartree
oneelecener: -7899.11256944 hartree
twoeener: 3241.92497191 hartree
cpcmener: -0.04371798 hartree
kineticenergy: 2212.02012471 hartree
xcener: -146.614430998840 hartree
chargesum: 0.0000000
charge: -0.068509 -0.081979 0.856397 -0.244690 -0.544989 -0.535381 -0.321293 -0.040896 0.263004 -0.086428 -0.082383 -0.291567 -0.305257 -0.170582 -0.029551 -0.018297 -0.146797 -0.005416 -0.139626 0.284704 0.036338 -0.254944 0.124275 0.124864 0.106760 0.106160 0.080227 0.103139 0.107901 0.102450 0.148597 0.166143 0.144085 0.124810 0.096532 0.113913 0.089458 0.092739 0.096087
qa: -0.0685 -0.0820 0.8564 -0.2447 -0.5450 -0.5354 -0.3213 -0.0409 0.2630 -0.0864 -0.0824 -0.2916 -0.3053 -0.1706 -0.0296 -0.0183 -0.1468 -0.0054 -0.1396 0.2847 0.0363 -0.2549 0.1243 0.1249 0.1068 0.1062 0.0802 0.1031 0.1079 0.1025 0.1486 0.1661 0.1441 0.1248 0.0965 0.1139 0.0895 0.0927 0.0961
va: 1.2605 1.2339 5.5298 2.0306 1.9428 1.9428 2.1015 2.9677 3.8115 3.9178 4.0015 3.9699 3.9739 3.8358 3.5846 4.0584 3.9419 3.8925 3.8613 3.9611 3.8647 3.9153 1.0190 1.0095 1.0026 1.0117 1.0187 1.0021 1.0018 1.0068 1.0219 1.0139 1.0032 1.0247 0.9949 0.9921 1.0058 1.0011 1.0085
dispcorr: -0.023939104 hartree
energy: -2218.060541283300
dipole: -10.41509 6.91813 -3.49696 19.73372 -19.27766 0.45606 8.19370 -7.46316 0.73054
magnitude: 3.60144 au
magnitude: 9.15414 debye
