program: Orca
programVersion: 5.0.2
elementType: Cl Cl S O O O O N C C C C C C C C C C C C C C H H H H H H H H H H H H H H H H H
charge: 0
multiplicity: 1
keywords: wb97x-d3
keywords: def2-TZVPP
keywords: def2/J RIJCOSX
keywords: DEFGRID2
keywords: scfconv7
keywords: smallprint printgap noloewdin
keywords: NOSOSCF
formula: C14H17Cl2NO4S
InChI: InChI=1/C14H17Cl2NO4S/c1-4-20-12-6-10(15)9(5-11(12)16)8-22(18,19)13-7-14(2,3)21-17-13/h5-6H,4,7-8H2,1-3H3
39 atoms
Cl -0.274852 -0.368152 2.673366
Cl -1.438471 -2.182995 -3.140192
S  2.936546 -0.352921 0.208349
O  1.399904 2.887816 1.489894
O  3.087429 -0.517102 -1.234748
O  4.125369 -0.310431 1.051504
O  -3.294523 -0.913842 -1.36739
N  2.134699 1.770491 1.518194
C  0.715707 3.043119 0.19036
C  1.149439 1.793237 -0.597839
C  2.014546 1.142607 0.419755
C  1.223079 4.328335 -0.428255
C  -0.772563 3.079461 0.46388
C  1.850314 -1.654572 0.826704
C  0.462193 -1.484687 0.309246
C  -0.554938 -0.890195 1.047356
C  0.156957 -1.880614 -0.992983
C  -1.09677 -1.682752 -1.525951
C  -1.823509 -0.686457 0.52701
C  -2.11162 -1.073593 -0.776714
C  -4.347376 -0.265229 -0.648389
C  -5.547966 -0.185134 -1.554676
H  0.306127 1.16695 -0.896235
H  1.710659 2.041347 -1.500416
H  2.302576 4.295635 -0.58047
H  0.752123 4.479144 -1.399955
H  0.983887 5.190135 0.19585
H  -1.315405 3.17388 -0.4768
H  -1.111413 2.1663 0.954173
H  -1.038795 3.930803 1.091283
H  1.916355 -1.629843 1.913349
H  2.30823 -2.583957 0.478597
H  0.918072 -2.361247 -1.593362
H  -2.579087 -0.223553 1.145673
H  -4.02439 0.735143 -0.345513
H  -4.583472 -0.833625 0.25576
H  -6.359841 0.309904 -1.02279
H  -5.896952 -1.174709 -1.849097
H  -5.33546 0.394346 -2.452935
elementType: Cl S O N C H
totalener: -2218.03836598 hartree
nucrepener: 2469.75157661 hartree
electener: -4687.78994259 hartree
oneelecener: -7960.02312742 hartree
twoeener: 3272.23318484 hartree
cpcmener: -0.04459390 hartree
kineticenergy: 2212.03532001 hartree
xcener: -146.617455674401 hartree
chargesum: -0.0000000
charge: -0.067366 -0.080255 0.851607 -0.239983 -0.539454 -0.546006 -0.314933 -0.029084 0.258855 -0.069547 -0.105766 -0.300849 -0.302179 -0.158245 -0.040720 -0.003157 -0.121695 -0.005275 -0.182466 0.312401 0.052112 -0.272983 0.112874 0.121242 0.107349 0.102532 0.103255 0.106180 0.093769 0.109998 0.153138 0.159539 0.125983 0.129212 0.103355 0.106384 0.092459 0.088909 0.088810
qa: -0.0674 -0.0803 0.8516 -0.2400 -0.5395 -0.5460 -0.3149 -0.0291 0.2589 -0.0695 -0.1058 -0.3008 -0.3022 -0.1582 -0.0407 -0.0032 -0.1217 -0.0053 -0.1825 0.3124 0.0521 -0.2730 0.1129 0.1212 0.1073 0.1025 0.1033 0.1062 0.0938 0.1100 0.1531 0.1595 0.1260 0.1292 0.1034 0.1064 0.0925 0.0889 0.0888
va: 1.2631 1.2332 5.5292 2.0322 1.9339 1.9407 2.1104 2.9768 3.8323 3.9130 4.0214 3.9647 3.9681 3.8114 3.5713 3.9796 4.0563 3.9155 3.8303 3.9181 3.7988 3.9714 1.0217 1.0219 1.0026 1.0027 1.0070 1.0028 1.0072 1.0097 1.0277 1.0112 1.0303 1.0260 0.9850 0.9860 1.0051 1.0031 1.0031
dispcorr: -0.024983762 hartree
energy: -2218.063349743811
dipole: -18.27175 14.25250 -4.01925 21.22575 -20.57194 0.65381 -4.03934 3.63950 -0.39983
magnitude: 4.09166 au
magnitude: 10.40017 debye
