program: Orca
programVersion: 5.0.2
elementType: Cl Cl S O O O O N C C C C C C C C C C C C C C H H H H H H H H H H H H H H H H H
charge: 0
multiplicity: 1
keywords: wb97x-d3
keywords: def2-TZVPP
keywords: def2/J RIJCOSX
keywords: DEFGRID2
keywords: scfconv7
keywords: smallprint printgap noloewdin
keywords: NOSOSCF
formula: C14H17Cl2NO4S
InChI: InChI=1/C14H17Cl2NO4S/c1-4-20-12-6-10(15)9(5-11(12)16)8-22(18,19)13-7-14(2,3)21-17-13/h5-6H,4,7-8H2,1-3H3
39 atoms
Cl 0.570298 -3.159693 1.633111
Cl -2.695354 0.818715 -1.822987
S  2.820214 -0.379706 0.246803
O  2.103939 2.833622 -1.67865
O  4.202847 -0.577842 -0.175133
O  2.48349 -0.459927 1.663755
O  -3.692825 -0.694499 0.392682
N  2.607802 1.614961 -1.445384
C  1.362059 3.333558 -0.503247
C  1.456805 2.173387 0.505496
C  2.275407 1.221013 -0.284124
C  -0.057423 3.608622 -0.948576
C  2.073284 4.583509 -0.029986
C  1.78358 -1.516523 -0.696713
C  0.338314 -1.348248 -0.372607
C  -0.29765 -2.020486 0.665198
C  -0.4352 -0.469392 -1.129856
C  -1.769567 -0.268274 -0.85561
C  -1.640596 -1.832216 0.952483
C  -2.399022 -0.944626 0.196004
C  -4.38449 -1.368371 1.447547
C  -5.818103 -0.905178 1.428964
H  1.954584 2.463119 1.4322
H  0.482988 1.755519 0.767314
H  -0.0879 4.369926 -1.728717
H  -0.539821 2.706194 -1.324078
H  -0.642451 3.972579 -0.103835
H  3.105689 4.370768 0.249693
H  2.072873 5.353414 -0.80254
H  1.564404 4.987715 0.844917
H  2.16877 -2.51336 -0.470003
H  1.990177 -1.310038 -1.747932
H  0.021345 0.056596 -1.958332
H  -2.087247 -2.38495 1.766862
H  -3.913975 -1.13409 2.406671
H  -4.326634 -2.450049 1.296438
H  -6.365651 -1.412458 2.222675
H  -6.30462 -1.144271 0.483336
H  -5.896757 0.16785 1.602437
elementType: Cl S O N C H
totalener: -2218.03845326 hartree
nucrepener: 2427.18652191 hartree
electener: -4645.22497517 hartree
oneelecener: -7875.26802110 hartree
twoeener: 3230.04304593 hartree
cpcmener: -0.04295637 hartree
kineticenergy: 2212.02708780 hartree
xcener: -146.614180687146 hartree
chargesum: -0.0000000
charge: -0.068551 -0.082006 0.857235 -0.245329 -0.544511 -0.535233 -0.314351 -0.041930 0.260397 -0.086949 -0.079843 -0.285644 -0.305175 -0.178100 -0.027892 -0.015210 -0.133824 -0.012886 -0.146371 0.296275 0.048256 -0.272636 0.125095 0.123662 0.105364 0.077685 0.106418 0.107395 0.102447 0.102631 0.149932 0.166794 0.141524 0.123185 0.106930 0.104865 0.092392 0.088813 0.089145
qa: -0.0686 -0.0820 0.8572 -0.2453 -0.5445 -0.5352 -0.3144 -0.0419 0.2604 -0.0869 -0.0798 -0.2856 -0.3052 -0.1781 -0.0279 -0.0152 -0.1338 -0.0129 -0.1464 0.2963 0.0483 -0.2726 0.1251 0.1237 0.1054 0.0777 0.1064 0.1074 0.1024 0.1026 0.1499 0.1668 0.1415 0.1232 0.1069 0.1049 0.0924 0.0888 0.0891
va: 1.2597 1.2334 5.5263 2.0286 1.9421 1.9433 2.1055 2.9655 3.8171 3.9151 4.0036 3.9699 3.9749 3.8360 3.5802 4.0786 3.9349 3.8918 3.8771 3.9524 3.8009 3.9701 1.0180 1.0113 1.0115 1.0209 1.0034 1.0020 1.0068 1.0021 1.0220 1.0142 1.0059 1.0297 0.9850 0.9854 1.0052 1.0032 1.0030
dispcorr: -0.023429114 hartree
energy: -2218.061882378195
dipole: -13.84860 10.43513 -3.41347 19.41764 -18.91790 0.49975 5.10493 -4.42240 0.68253
magnitude: 3.51673 au
magnitude: 8.93881 debye
