program: Orca
programVersion: 5.0.2
elementType: Cl Cl S O O O O N C C C C C C C C C C C C C C H H H H H H H H H H H H H H H H H
charge: 0
multiplicity: 1
keywords: wb97x-d3
keywords: def2-TZVPP
keywords: def2/J RIJCOSX
keywords: DEFGRID2
keywords: scfconv7
keywords: smallprint printgap noloewdin
keywords: NOSOSCF
formula: C14H17Cl2NO4S
InChI: InChI=1/C14H17Cl2NO4S/c1-4-20-12-6-10(15)9(5-11(12)16)8-22(18,19)13-7-14(2,3)21-17-13/h5-6H,4,7-8H2,1-3H3
39 atoms
Cl 0.634432 -3.515446 -0.573894
Cl -3.169656 0.990266 1.349852
S  2.544269 -0.271756 -0.244038
O  1.679554 3.249222 0.980969
O  2.023204 -0.620775 -1.558672
O  3.957411 -0.499267 0.035489
O  -3.924351 -1.309515 -0.182092
N  1.797116 1.914257 1.04783
C  2.162581 3.752165 -0.316346
C  2.506725 2.46963 -1.099873
C  2.23984 1.457654 -0.045396
C  3.384523 4.603442 -0.040476
C  1.030899 4.538845 -0.94281
C  1.575042 -1.070158 1.054313
C  0.130794 -1.177119 0.706073
C  -0.392782 -2.232814 -0.031502
C  -0.760581 -0.191282 1.125704
C  -2.100849 -0.25459 0.815843
C  -1.740414 -2.318146 -0.34367
C  -2.618615 -1.322008 0.072223
C  -4.510122 -2.392431 -0.906492
C  -5.985674 -2.114996 -1.035819
H  1.868808 2.315811 -1.97245
H  3.544639 2.447492 -1.437759
H  4.173275 4.022252 0.440013
H  3.782395 4.997012 -0.9764
H  3.139883 5.451191 0.601099
H  1.340462 4.924714 -1.914588
H  0.150236 3.913399 -1.095572
H  0.747414 5.38997 -0.321972
H  1.738577 -0.495332 1.967196
H  2.060781 -2.038825 1.191976
H  -0.389679 0.638843 1.712199
H  -2.097271 -3.164556 -0.913325
H  -4.339104 -3.331906 -0.371756
H  -4.045615 -2.4754 -1.893874
H  -6.470136 -2.053298 -0.060869
H  -6.454671 -2.927778 -1.590506
H  -6.173884 -1.188637 -1.579061
elementType: Cl S O N C H
totalener: -2218.04310452 hartree
nucrepener: 2375.18697205 hartree
electener: -4593.23007657 hartree
oneelecener: -7772.35079007 hartree
twoeener: 3179.12071349 hartree
cpcmener: -0.03204643 hartree
kineticenergy: 2212.04712609 hartree
xcener: -146.615846522956 hartree
chargesum: 0.0000000
charge: -0.069348 -0.079243 0.831978 -0.243923 -0.516514 -0.529728 -0.303974 -0.090804 0.237113 -0.111928 0.013956 -0.299627 -0.290620 -0.167270 -0.038095 -0.043770 -0.093281 -0.024897 -0.142050 0.278862 0.045562 -0.270327 0.118425 0.122499 0.107923 0.099624 0.101783 0.100424 0.103971 0.101686 0.161552 0.160736 0.133481 0.121199 0.103707 0.102681 0.088920 0.090773 0.088545
qa: -0.0693 -0.0792 0.8320 -0.2439 -0.5165 -0.5297 -0.3040 -0.0908 0.2371 -0.1119 0.0140 -0.2996 -0.2906 -0.1673 -0.0381 -0.0438 -0.0933 -0.0249 -0.1420 0.2789 0.0456 -0.2703 0.1184 0.1225 0.1079 0.0996 0.1018 0.1004 0.1040 0.1017 0.1616 0.1607 0.1335 0.1212 0.1037 0.1027 0.0889 0.0908 0.0885
va: 1.2593 1.2370 5.5526 2.0285 1.9600 1.9505 2.1161 2.9350 3.8588 3.9525 3.9153 3.9737 3.9597 3.7766 3.6182 4.1054 3.9661 3.9395 3.8639 3.9577 3.8092 3.9718 1.0198 1.0108 1.0018 1.0026 1.0074 1.0026 1.0044 1.0074 1.0217 1.0211 1.0275 1.0300 0.9854 0.9849 1.0034 1.0053 1.0036
dispcorr: -0.020951992 hartree
energy: -2218.064056516157
dipole: -3.86647 2.49380 -1.37268 18.71078 -18.03315 0.67763 -8.84239 8.27547 -0.56692
magnitude: 1.63243 au
magnitude: 4.14930 debye
