program: Orca
programVersion: 5.0.2
elementType: Cl Cl S O O O O N C C C C C C C C C C C C C C H H H H H H H H H H H H H H H H H
charge: 0
multiplicity: 1
keywords: wb97x-d3
keywords: def2-TZVPP
keywords: def2/J RIJCOSX
keywords: DEFGRID2
keywords: scfconv7
keywords: smallprint printgap noloewdin
keywords: NOSOSCF
formula: C14H17Cl2NO4S
InChI: InChI=1/C14H17Cl2NO4S/c1-4-20-12-6-10(15)9(5-11(12)16)8-22(18,19)13-7-14(2,3)21-17-13/h5-6H,4,7-8H2,1-3H3
39 atoms
Cl 0.489047 -1.603451 -2.149232
Cl -2.417594 -0.643953 3.246175
S  2.820647 -0.143256 0.883857
O  1.888949 1.843448 -2.229253
O  4.218654 -0.371005 0.546711
O  2.467059 0.382892 2.197981
O  -3.590585 -0.455096 0.637113
N  2.542019 0.94992 -1.479468
C  0.93257 2.617042 -1.415827
C  1.021976 1.956426 -0.027112
C  2.106241 0.974776 -0.290388
C  -0.429443 2.470197 -2.059248
C  1.418029 4.052136 -1.40283
C  1.915158 -1.682842 0.612596
C  0.445615 -1.433336 0.565618
C  -0.274765 -1.333577 -0.619489
C  -0.252603 -1.218956 1.75459
C  -1.592414 -0.904208 1.754927
C  -1.625464 -1.019237 -0.636505
C  -2.304103 -0.782725 0.553762
C  -4.34677 -0.29024 -0.563425
C  -5.740913 0.134716 -0.179835
H  1.295268 2.664109 0.757302
H  0.091272 1.471231 0.276973
H  -1.171399 3.024488 -1.483357
H  -0.433286 2.865875 -3.075834
H  -0.745215 1.426658 -2.09212
H  2.421224 4.128858 -0.980249
H  1.433497 4.475382 -2.408367
H  0.751532 4.663506 -0.793182
H  2.199177 -2.325465 1.450544
H  2.312831 -2.123792 -0.300651
H  0.269401 -1.307178 2.698308
H  -2.138396 -0.960422 -1.585944
H  -4.369751 -1.232513 -1.119555
H  -3.87502 0.466647 -1.198655
H  -5.739116 1.085051 0.35427
H  -6.233974 -0.61455 0.440731
H  -6.335701 0.261855 -1.084672
elementType: Cl S O N C H
totalener: -2218.04204447 hartree
nucrepener: 2471.90385394 hartree
electener: -4689.94589842 hartree
oneelecener: -7964.42411525 hartree
twoeener: 3274.47821683 hartree
cpcmener: -0.03665490 hartree
kineticenergy: 2212.03942620 hartree
xcener: -146.616941982935 hartree
chargesum: -0.0000000
charge: -0.064341 -0.077200 0.843482 -0.229049 -0.527911 -0.526451 -0.304032 -0.027886 0.245306 -0.074457 -0.105444 -0.291110 -0.301953 -0.165019 -0.041451 0.001004 -0.121098 -0.004991 -0.192877 0.310933 0.047127 -0.270620 0.121649 0.110503 0.104685 0.108622 0.090212 0.108830 0.102169 0.099718 0.156875 0.151216 0.123792 0.125326 0.104980 0.099872 0.088903 0.089640 0.091049
qa: -0.0643 -0.0772 0.8435 -0.2290 -0.5279 -0.5265 -0.3040 -0.0279 0.2453 -0.0745 -0.1054 -0.2911 -0.3020 -0.1650 -0.0415 0.0010 -0.1211 -0.0050 -0.1929 0.3109 0.0471 -0.2706 0.1216 0.1105 0.1047 0.1086 0.0902 0.1088 0.1022 0.0997 0.1569 0.1512 0.1238 0.1253 0.1050 0.0999 0.0889 0.0896 0.0910
va: 1.2663 1.2365 5.5499 2.0372 1.9642 1.9509 2.1214 2.9833 3.8499 3.9119 4.0149 3.9593 3.9726 3.8156 3.5767 3.9866 4.0540 3.9214 3.8323 3.9152 3.8078 3.9725 1.0213 1.0228 1.0031 1.0098 1.0067 1.0017 1.0073 1.0029 1.0117 1.0293 1.0320 1.0280 0.9856 0.9846 1.0034 1.0034 1.0052
dispcorr: -0.025008580 hartree
energy: -2218.067053053476
dipole: -16.86147 13.24367 -3.61780 19.46696 -18.97128 0.49568 -12.14141 10.98959 -1.15181
magnitude: 3.82895 au
magnitude: 9.73241 debye
