program: Orca
programVersion: 5.0.2
elementType: Cl Cl S O O O O N C C C C C C C C C C C C C C H H H H H H H H H H H H H H H H H
charge: 0
multiplicity: 1
keywords: wb97x-d3
keywords: def2-TZVPP
keywords: def2/J RIJCOSX
keywords: DEFGRID2
keywords: scfconv7
keywords: smallprint printgap noloewdin
keywords: NOSOSCF
formula: C14H17Cl2NO4S
InChI: InChI=1/C14H17Cl2NO4S/c1-4-20-12-6-10(15)9(5-11(12)16)8-22(18,19)13-7-14(2,3)21-17-13/h5-6H,4,7-8H2,1-3H3
39 atoms
Cl 0.47118 -1.568969 -2.157066
Cl -2.426313 -0.689882 3.257733
S  2.785877 -0.127358 0.915255
O  1.980145 1.873479 -2.223499
O  4.197996 -0.344623 0.635186
O  2.374869 0.393838 2.214884
O  -3.608507 -0.483213 0.656996
N  2.608979 0.983681 -1.449343
C  0.973741 2.626418 -1.451022
C  1.003713 1.954272 -0.065618
C  2.112205 0.988597 -0.284175
C  -0.352865 2.467712 -2.162254
C  1.440081 4.06689 -1.401237
C  1.903517 -1.671796 0.603291
C  0.431553 -1.43703 0.559609
C  -0.292183 -1.325502 -0.621827
C  -0.264775 -1.24199 1.75318
C  -1.605056 -0.932328 1.76092
C  -1.644973 -1.019345 -0.63183
C  -2.320884 -0.801478 0.563386
C  -4.368361 -0.280129 -0.535137
C  -5.755392 0.145401 -0.129354
H  1.230032 2.657672 0.736965
H  0.065937 1.454975 0.188391
H  -0.644435 1.419203 -2.232047
H  -1.13267 2.995452 -1.612476
H  -0.3152 2.884152 -3.169641
H  1.509855 4.496656 -2.401305
H  0.731907 4.666427 -0.828272
H  2.415437 4.15195 -0.919715
H  2.193229 -2.332128 1.425175
H  2.310143 -2.083741 -0.319375
H  0.259583 -1.339875 2.694443
H  -2.161622 -0.951976 -1.578695
H  -4.402304 -1.206549 -1.11656
H  -3.893701 0.4898 -1.151351
H  -5.738832 1.07454 0.440584
H  -6.253572 -0.620905 0.46485
H  -6.353456 0.314128 -1.024756
elementType: Cl S O N C H
totalener: -2218.04214260 hartree
nucrepener: 2468.87660389 hartree
electener: -4686.91874649 hartree
oneelecener: -7958.37962317 hartree
twoeener: 3271.46087668 hartree
cpcmener: -0.03658396 hartree
kineticenergy: 2212.04831104 hartree
xcener: -146.618558186309 hartree
chargesum: -0.0000000
charge: -0.065769 -0.077118 0.843916 -0.228306 -0.527770 -0.526834 -0.303885 -0.026150 0.240249 -0.068497 -0.107623 -0.289719 -0.301472 -0.161398 -0.045725 -0.001368 -0.119056 -0.007563 -0.184377 0.308187 0.046572 -0.270159 0.121927 0.107485 0.089460 0.104388 0.108440 0.102419 0.099847 0.108805 0.156832 0.150427 0.124109 0.125397 0.104520 0.100696 0.088484 0.089771 0.090859
qa: -0.0658 -0.0771 0.8439 -0.2283 -0.5278 -0.5268 -0.3039 -0.0262 0.2402 -0.0685 -0.1076 -0.2897 -0.3015 -0.1614 -0.0457 -0.0014 -0.1191 -0.0076 -0.1844 0.3082 0.0466 -0.2702 0.1219 0.1075 0.0895 0.1044 0.1084 0.1024 0.0998 0.1088 0.1568 0.1504 0.1241 0.1254 0.1045 0.1007 0.0885 0.0898 0.0909
va: 1.2638 1.2368 5.5506 2.0385 1.9652 1.9497 2.1204 2.9819 3.8573 3.9084 4.0147 3.9585 3.9719 3.8169 3.5868 3.9839 4.0532 3.9258 3.8314 3.9198 3.8087 3.9725 1.0214 1.0242 1.0098 1.0030 1.0098 1.0077 1.0029 1.0016 1.0118 1.0303 1.0324 1.0277 0.9854 0.9853 1.0037 1.0032 1.0054
dispcorr: -0.024895123 hartree
energy: -2218.067037721773
dipole: -16.67645 13.06319 -3.61326 19.52929 -19.04402 0.48527 -12.47303 11.21795 -1.25508
magnitude: 3.85570 au
magnitude: 9.80040 debye
