program: Orca
programVersion: 5.0.2
elementType: Cl Cl S O O O O N C C C C C C C C C C C C C C H H H H H H H H H H H H H H H H H
charge: 0
multiplicity: 1
keywords: wb97x-d3
keywords: def2-TZVPP
keywords: def2/J RIJCOSX
keywords: DEFGRID2
keywords: scfconv7
keywords: smallprint printgap noloewdin
keywords: NOSOSCF
formula: C14H17Cl2NO4S
InChI: InChI=1/C14H17Cl2NO4S/c1-4-20-12-6-10(15)9(5-11(12)16)8-22(18,19)13-7-14(2,3)21-17-13/h5-6H,4,7-8H2,1-3H3
39 atoms
Cl 0.618568 -3.45486 -0.801397
Cl -2.89831 1.077044 1.556468
S  2.721586 -0.401466 -0.091098
O  1.773552 3.103831 1.100793
O  2.347349 -0.797929 -1.441114
O  4.111062 -0.520875 0.33066
O  -3.758364 -0.927062 -0.288894
N  2.16986 1.828094 1.198163
C  1.458229 3.449751 -0.297768
C  1.836007 2.177982 -1.080976
C  2.208078 1.29177 0.052694
C  2.305141 4.650049 -0.664606
C  -0.027147 3.743651 -0.361706
C  1.694264 -1.272801 1.110779
C  0.253725 -1.244204 0.729232
C  -0.31969 -2.157648 -0.149024
C  -0.57583 -0.250599 1.247138
C  -1.904444 -0.16843 0.895628
C  -1.656275 -2.091022 -0.510473
C  -2.469729 -1.085296 0.00213
C  -4.39021 -1.816839 -1.209263
C  -5.822281 -1.37443 -1.360275
H  1.004773 1.775956 -1.662273
H  2.675569 2.332198 -1.762464
H  2.07527 5.506409 -0.028913
H  3.3690 4.427233 -0.573903
H  2.109886 4.941664 -1.697101
H  -0.294586 4.586009 0.277975
H  -0.310259 3.997762 -1.38389
H  -0.61918 2.878341 -0.058028
H  1.874089 -0.798112 2.075602
H  2.11301 -2.280494 1.156662
H  -0.167822 0.465198 1.948864
H  -2.05413 -2.828904 -1.193175
H  -4.340939 -2.841965 -0.831655
H  -3.873472 -1.785568 -2.172262
H  -6.358645 -1.423316 -0.413642
H  -6.329363 -2.032258 -2.065988
H  -5.88726 -0.357208 -1.74553
elementType: Cl S O N C H
totalener: -2218.04271286 hartree
nucrepener: 2417.09629381 hartree
electener: -4635.13900667 hartree
oneelecener: -7855.58418867 hartree
twoeener: 3220.44518200 hartree
cpcmener: -0.03380797 hartree
kineticenergy: 2212.04821064 hartree
xcener: -146.615753164039 hartree
chargesum: -0.0000000
charge: -0.067100 -0.082979 0.847105 -0.237013 -0.520135 -0.526386 -0.304702 -0.057812 0.241547 -0.078018 -0.064492 -0.293550 -0.282455 -0.194994 -0.001338 -0.025611 -0.138585 -0.007834 -0.143413 0.283185 0.044436 -0.270259 0.112560 0.122764 0.101491 0.105157 0.100648 0.103143 0.101218 0.084751 0.164595 0.152338 0.134528 0.121572 0.103495 0.103797 0.089139 0.090766 0.088440
qa: -0.0671 -0.0830 0.8471 -0.2370 -0.5201 -0.5264 -0.3047 -0.0578 0.2415 -0.0780 -0.0645 -0.2935 -0.2825 -0.1950 -0.0013 -0.0256 -0.1386 -0.0078 -0.1434 0.2832 0.0444 -0.2703 0.1126 0.1228 0.1015 0.1052 0.1006 0.1031 0.1012 0.0848 0.1646 0.1523 0.1345 0.1216 0.1035 0.1038 0.0891 0.0908 0.0884
va: 1.2605 1.2307 5.5393 2.0309 1.9622 1.9582 2.1128 2.9497 3.8466 3.9047 3.9975 3.9592 3.9829 3.8317 3.5530 4.0878 3.9802 3.9082 3.8723 3.9624 3.8104 3.9722 1.0207 1.0121 1.0073 1.0040 1.0023 1.0089 1.0048 1.0057 1.0172 1.0238 1.0178 1.0299 0.9849 0.9852 1.0032 1.0056 1.0035
dispcorr: -0.022589813 hartree
energy: -2218.065302674806
dipole: -11.18129 8.61296 -2.56833 18.57887 -18.04560 0.53327 -10.74702 9.75819 -0.98883
magnitude: 2.80330 au
magnitude: 7.12542 debye
