program: Orca
programVersion: 5.0.2
elementType: Cl Cl S O O O O N C C C C C C C C C C C C C C H H H H H H H H H H H H H H H H H
charge: 0
multiplicity: 1
keywords: wb97x-d3
keywords: def2-TZVPP
keywords: def2/J RIJCOSX
keywords: DEFGRID2
keywords: scfconv7
keywords: smallprint printgap noloewdin
keywords: NOSOSCF
formula: C14H17Cl2NO4S
InChI: InChI=1/C14H17Cl2NO4S/c1-4-20-12-6-10(15)9(5-11(12)16)8-22(18,19)13-7-14(2,3)21-17-13/h5-6H,4,7-8H2,1-3H3
39 atoms
Cl -0.543168 1.878356 1.541115
Cl -1.836644 -3.926814 -0.220409
S  2.75058 -0.224566 0.55684
O  2.189634 3.381985 -0.520711
O  2.674594 -1.284294 -0.44256
O  3.987752 0.011078 1.288195
O  -3.610202 -1.691214 -0.364566
N  2.589992 2.369618 0.255287
C  1.690196 2.881567 -1.815285
C  1.616002 1.358402 -1.604876
C  2.303147 1.262994 -0.290314
C  2.717313 3.265142 -2.8628
C  0.341895 3.521782 -2.061187
C  1.45922 -0.484081 1.789584
C  0.115877 -0.733588 1.195514
C  -0.855932 0.247905 1.047384
C  -0.213754 -2.023848 0.778466
C  -1.454902 -2.315749 0.260901
C  -2.110921 -0.026925 0.52456
C  -2.431921 -1.320053 0.12803
C  -4.656207 -0.727835 -0.487157
C  -5.873524 -1.436431 -1.023083
H  0.592086 0.978638 -1.553834
H  2.136292 0.802568 -2.385797
H  2.838645 4.347891 -2.91907
H  3.690523 2.819286 -2.648979
H  2.397955 2.912654 -3.844192
H  -0.061487 3.177213 -3.013736
H  -0.371387 3.258098 -1.279625
H  0.420505 4.608977 -2.106727
H  1.493507 0.374285 2.460972
H  1.809102 -1.355314 2.350806
H  0.515002 -2.816462 0.888626
H  -2.832031 0.77369 0.437997
H  -4.346221 0.074038 -1.164479
H  -4.86934 -0.282817 0.489671
H  -6.207036 -2.225921 -0.349144
H  -5.686128 -1.870985 -2.005306
H  -6.688027 -0.719298 -1.125233
elementType: Cl S O N C H
totalener: -2218.04282046 hartree
nucrepener: 2417.70486716 hartree
electener: -4635.74768762 hartree
oneelecener: -7856.42134291 hartree
twoeener: 3220.67365529 hartree
cpcmener: -0.03614709 hartree
kineticenergy: 2212.04073455 hartree
xcener: -146.615081454968 hartree
chargesum: -0.0000000
charge: -0.070663 -0.077284 0.847669 -0.225823 -0.527344 -0.528487 -0.303165 -0.023952 0.224952 -0.071380 -0.122562 -0.304173 -0.271601 -0.167202 -0.001996 -0.075943 -0.118618 -0.015975 -0.103900 0.271329 0.044845 -0.270536 0.120617 0.121599 0.102445 0.110896 0.098585 0.102094 0.091489 0.103830 0.158187 0.158453 0.125844 0.122590 0.103384 0.102983 0.088641 0.089441 0.090731
qa: -0.0707 -0.0773 0.8477 -0.2258 -0.5273 -0.5285 -0.3032 -0.0240 0.2250 -0.0714 -0.1226 -0.3042 -0.2716 -0.1672 -0.0020 -0.0759 -0.1186 -0.0160 -0.1039 0.2713 0.0448 -0.2705 0.1206 0.1216 0.1024 0.1109 0.0986 0.1021 0.0915 0.1038 0.1582 0.1585 0.1258 0.1226 0.1034 0.1030 0.0886 0.0894 0.0907
va: 1.2562 1.2369 5.5536 2.0398 1.9524 1.9657 2.1167 2.9599 3.8701 3.8941 4.0269 3.9806 3.9426 3.8085 3.5479 4.0113 4.0655 3.9176 3.8092 3.9703 3.8097 3.9725 1.0123 1.0228 1.0076 1.0000 1.0033 1.0034 1.0148 1.0083 1.0245 1.0104 1.0275 1.0280 0.9851 0.9856 1.0036 1.0032 1.0053
dispcorr: -0.023041457 hartree
energy: -2218.065861918267
dipole: -11.76260 8.32313 -3.43947 16.10705 -15.07713 1.02992 -18.33460 17.12479 -1.20981
magnitude: 3.78871 au
magnitude: 9.63014 debye
