program: Orca
programVersion: 5.0.2
elementType: Cl Cl S O O O O N C C C C C C C C C C C C C C H H H H H H H H H H H H H H H H H
charge: 0
multiplicity: 1
keywords: wb97x-d3
keywords: def2-TZVPP
keywords: def2/J RIJCOSX
keywords: DEFGRID2
keywords: scfconv7
keywords: smallprint printgap noloewdin
keywords: NOSOSCF
formula: C14H17Cl2NO4S
InChI: InChI=1/C14H17Cl2NO4S/c1-4-20-12-6-10(15)9(5-11(12)16)8-22(18,19)13-7-14(2,3)21-17-13/h5-6H,4,7-8H2,1-3H3
39 atoms
Cl -1.07273 -0.761515 -2.488503
Cl -2.163043 -2.203538 3.444476
S  1.038672 1.31351 0.057118
O  4.413971 1.711121 -1.688542
O  1.129603 1.554175 1.492599
O  -0.053928 1.938413 -0.676942
O  -4.033857 -2.405347 1.293149
N  3.336121 1.065008 -1.21462
C  4.285758 3.162707 -1.482004
C  2.987698 3.301744 -0.661386
C  2.544853 1.88406 -0.664697
C  4.171821 3.800879 -2.85188
C  5.5141 3.622293 -0.726081
C  1.034098 -0.46883 -0.243582
C  -0.318634 -0.989239 0.109113
C  -1.340014 -1.137961 -0.821806
C  -0.603693 -1.321601 1.432723
C  -1.844424 -1.791901 1.800653
C  -2.592707 -1.614092 -0.468623
C  -2.86584 -1.944243 0.85459
C  -5.107838 -2.589578 0.370495
C  -6.294875 -3.105873 1.142185
H  3.158626 3.662035 0.355465
H  2.257525 3.962681 -1.13135
H  3.299483 3.429676 -3.392389
H  4.068323 4.88182 -2.75193
H  5.060162 3.604369 -3.453869
H  5.457634 4.696213 -0.54536
H  5.596353 3.12353 0.240435
H  6.424814 3.4286 -1.294654
H  1.815399 -0.898425 0.383601
H  1.298073 -0.636683 -1.287122
H  0.17167 -1.222729 2.181454
H  -3.349153 -1.722731 -1.233038
H  -4.812768 -3.302309 -0.405938
H  -5.348671 -1.639197 -0.115708
H  -7.128339 -3.256363 0.456043
H  -6.615741 -2.397719 1.906416
H  -6.07932 -4.062156 1.61955
elementType: Cl S O N C H
totalener: -2218.04348431 hartree
nucrepener: 2314.08191606 hartree
electener: -4532.12540037 hartree
oneelecener: -7650.49616214 hartree
twoeener: 3118.37076176 hartree
cpcmener: -0.03322988 hartree
kineticenergy: 2212.04888935 hartree
xcener: -146.615548095627 hartree
chargesum: 0.0000000
charge: -0.070133 -0.079129 0.826979 -0.242885 -0.525616 -0.520442 -0.303585 -0.077731 0.236697 -0.116681 0.003291 -0.301315 -0.288034 -0.132585 -0.055099 -0.022462 -0.105976 -0.028351 -0.144390 0.286269 0.044511 -0.270473 0.123585 0.124521 0.108550 0.099507 0.101997 0.100611 0.103900 0.101577 0.162404 0.138505 0.125609 0.121360 0.103515 0.103263 0.090596 0.088641 0.088998
qa: -0.0701 -0.0791 0.8270 -0.2429 -0.5256 -0.5204 -0.3036 -0.0777 0.2367 -0.1167 0.0033 -0.3013 -0.2880 -0.1326 -0.0551 -0.0225 -0.1060 -0.0284 -0.1444 0.2863 0.0445 -0.2705 0.1236 0.1245 0.1086 0.0995 0.1020 0.1006 0.1039 0.1016 0.1624 0.1385 0.1256 0.1214 0.1035 0.1033 0.0906 0.0886 0.0890
va: 1.2567 1.2352 5.5648 2.0217 1.9516 1.9605 2.1161 2.9531 3.8662 3.9578 3.9266 3.9767 3.9551 3.7941 3.6443 4.0673 4.0427 3.9253 3.8666 3.9579 3.8097 3.9724 1.0150 1.0146 1.0014 1.0031 1.0073 1.0025 1.0049 1.0073 1.0130 1.0279 1.0281 1.0301 0.9852 0.9850 1.0054 1.0036 1.0033
dispcorr: -0.020040571 hartree
energy: -2218.063524883958
dipole: 9.70918 -9.33718 0.37200 14.26080 -14.02908 0.23172 -8.87965 7.66406 -1.21559
magnitude: 1.29218 au
magnitude: 3.28447 debye
