program: Orca
programVersion: 5.0.2
elementType: Cl Cl S O O O O N C C C C C C C C C C C C C C H H H H H H H H H H H H H H H H H
charge: 0
multiplicity: 1
keywords: wb97x-d3
keywords: def2-TZVPP
keywords: def2/J RIJCOSX
keywords: DEFGRID2
keywords: scfconv7
keywords: smallprint printgap noloewdin
keywords: NOSOSCF
formula: C14H17Cl2NO4S
InChI: InChI=1/C14H17Cl2NO4S/c1-4-20-12-6-10(15)9(5-11(12)16)8-22(18,19)13-7-14(2,3)21-17-13/h5-6H,4,7-8H2,1-3H3
39 atoms
Cl -0.523011 1.655981 1.635359
Cl -1.985001 -4.017904 -0.385694
S  2.608848 -0.363287 0.088092
O  0.82373 2.409189 -1.811484
O  2.398006 -1.393769 -0.918676
O  3.944492 -0.126156 0.623875
O  -3.737587 -1.761805 -0.301844
N  1.134732 1.159621 -1.448328
C  1.761577 3.373441 -1.209129
C  2.510143 2.530875 -0.160746
C  2.045454 1.178592 -0.566412
C  0.944709 4.503629 -0.623825
C  2.683978 3.845467 -2.315856
C  1.505278 -0.687487 1.48206
C  0.099147 -0.919054 1.04764
C  -0.880581 0.065704 1.050368
C  -0.274914 -2.182474 0.589802
C  -1.555939 -2.439342 0.157504
C  -2.174618 -0.171525 0.612889
C  -2.530099 -1.432482 0.147922
C  -4.757033 -0.764665 -0.376504
C  -5.982311 -1.402255 -0.978622
H  3.592247 2.640996 -0.235968
H  2.224774 2.764958 0.867926
H  0.374568 5.020417 -1.397073
H  0.249173 4.147798 0.136022
H  1.60659 5.233576 -0.157205
H  3.250243 3.017516 -2.745917
H  2.122268 4.330882 -3.115171
H  3.398205 4.569058 -1.921702
H  1.62397 0.14038 2.181687
H  1.932481 -1.577468 1.952363
H  0.454582 -2.98166 0.589758
H  -2.896821 0.632451 0.639711
H  -4.415376 0.070336 -0.995911
H  -4.973779 -0.378113 0.623963
H  -6.776782 -0.65855 -1.041742
H  -6.347206 -2.228882 -0.368908
H  -5.789105 -1.769623 -1.986763
elementType: Cl S O N C H
totalener: -2218.04324633 hartree
nucrepener: 2421.28474208 hartree
electener: -4639.32798841 hartree
oneelecener: -7864.55490939 hartree
twoeener: 3225.22692097 hartree
cpcmener: -0.03720919 hartree
kineticenergy: 2212.04613455 hartree
xcener: -146.616870480566 hartree
chargesum: 0.0000000
charge: -0.080824 -0.078825 0.852993 -0.224217 -0.520345 -0.536039 -0.304015 -0.027763 0.222518 -0.089525 -0.116784 -0.268394 -0.304020 -0.165992 -0.025005 -0.025604 -0.124295 -0.014191 -0.115274 0.272670 0.045097 -0.271367 0.120209 0.121225 0.104161 0.095819 0.102182 0.111744 0.102327 0.098315 0.158206 0.159014 0.125934 0.123945 0.103872 0.103086 0.090523 0.089115 0.089526
qa: -0.0808 -0.0788 0.8530 -0.2242 -0.5203 -0.5360 -0.3040 -0.0278 0.2225 -0.0895 -0.1168 -0.2684 -0.3040 -0.1660 -0.0250 -0.0256 -0.1243 -0.0142 -0.1153 0.2727 0.0451 -0.2714 0.1202 0.1212 0.1042 0.0958 0.1022 0.1117 0.1023 0.0983 0.1582 0.1590 0.1259 0.1239 0.1039 0.1031 0.0905 0.0891 0.0895
va: 1.2561 1.2355 5.5438 2.0380 1.9592 1.9608 2.1162 2.9438 3.8599 3.9123 3.9981 3.9358 3.9830 3.7984 3.5841 3.9920 4.0687 3.9156 3.8494 3.9805 3.8097 3.9724 1.0239 1.0174 1.0075 1.0135 1.0035 0.9994 1.0080 1.0036 1.0209 1.0126 1.0272 1.0276 0.9856 0.9850 1.0052 1.0032 1.0034
dispcorr: -0.022821093 hartree
energy: -2218.066067425756
dipole: -5.49814 3.97116 -1.52699 24.86961 -21.99614 2.87347 -7.08900 8.61590 1.52691
magnitude: 3.59444 au
magnitude: 9.13634 debye
