program: Orca
programVersion: 5.0.2
elementType: Cl Cl S O O O O N C C C C C C C C C C C C C C H H H H H H H H H H H H H H H H H
charge: 0
multiplicity: 1
keywords: wb97x-d3
keywords: def2-TZVPP
keywords: def2/J RIJCOSX
keywords: DEFGRID2
keywords: scfconv7
keywords: smallprint printgap noloewdin
keywords: NOSOSCF
formula: C14H17Cl2NO4S
InChI: InChI=1/C14H17Cl2NO4S/c1-4-20-12-6-10(15)9(5-11(12)16)8-22(18,19)13-7-14(2,3)21-17-13/h5-6H,4,7-8H2,1-3H3
39 atoms
Cl 0.689967 -3.545731 -0.482379
Cl -3.127873 0.973011 1.37843
S  2.548763 -0.262701 -0.374342
O  1.858884 3.312026 0.810757
O  1.941348 -0.619384 -1.64973
O  3.969862 -0.517531 -0.170877
O  -3.896809 -1.419559 -0.001985
N  1.915818 1.972392 0.905289
C  2.461437 3.758797 -0.455016
C  2.559019 2.461501 -1.275836
C  2.31047 1.478411 -0.190729
C  3.83113 4.321572 -0.126977
C  1.53962 4.792409 -1.061422
C  1.640538 -1.01603 0.996165
C  0.187227 -1.162297 0.709847
C  -0.342789 -2.261542 0.043796
C  -0.706619 -0.173829 1.116838
C  -2.056926 -0.278011 0.865687
C  -1.699363 -2.388331 -0.20725
C  -2.5814 -1.391018 0.197454
C  -4.476649 -2.534193 -0.681421
C  -5.959262 -2.291272 -0.791298
H  1.791472 2.380869 -2.049605
H  3.53127 2.340065 -1.754537
H  4.476252 3.567828 0.32871
H  4.319201 4.669239 -1.038166
H  3.755233 5.168552 0.556252
H  1.947459 5.137305 -2.011941
H  0.547944 4.380594 -1.251131
H  1.436512 5.661968 -0.410862
H  1.828647 -0.398684 1.875791
H  2.147977 -1.969446 1.157511
H  -0.329433 0.692276 1.644995
H  -2.059571 -3.268737 -0.720329
H  -4.276625 -3.453668 -0.122873
H  -4.030182 -2.637901 -1.67458
H  -6.419835 -3.132511 -1.309253
H  -6.177425 -1.388834 -1.362783
H  -6.427974 -2.206694 0.189071
elementType: Cl S O N C H
totalener: -2218.04311298 hartree
nucrepener: 2366.45077498 hartree
electener: -4584.49388796 hartree
oneelecener: -7754.90968178 hartree
twoeener: 3170.41579382 hartree
cpcmener: -0.03198685 hartree
kineticenergy: 2212.05275388 hartree
xcener: -146.616626553334 hartree
chargesum: 0.0000000
charge: -0.069152 -0.078786 0.830996 -0.245578 -0.515249 -0.527867 -0.304037 -0.089625 0.228368 -0.101954 0.005530 -0.306623 -0.274654 -0.170326 -0.036001 -0.048330 -0.087860 -0.028029 -0.140707 0.281094 0.046230 -0.270537 0.115203 0.122354 0.109936 0.098500 0.102674 0.099964 0.100788 0.101962 0.161783 0.162150 0.132592 0.120924 0.103296 0.102681 0.090708 0.088502 0.089084
qa: -0.0692 -0.0788 0.8310 -0.2456 -0.5152 -0.5279 -0.3040 -0.0896 0.2284 -0.1020 0.0055 -0.3066 -0.2747 -0.1703 -0.0360 -0.0483 -0.0879 -0.0280 -0.1407 0.2811 0.0462 -0.2705 0.1152 0.1224 0.1099 0.0985 0.1027 0.1000 0.1008 0.1020 0.1618 0.1622 0.1326 0.1209 0.1033 0.1027 0.0907 0.0885 0.0891
va: 1.2600 1.2374 5.5536 2.0261 1.9597 1.9519 2.1167 2.9263 3.8936 3.9466 3.9178 3.9863 3.9322 3.7756 3.6173 4.1061 3.9685 3.9438 3.8616 3.9551 3.8087 3.9718 1.0205 1.0118 1.0008 1.0034 1.0077 1.0026 1.0078 1.0073 1.0220 1.0206 1.0275 1.0302 0.9852 0.9851 1.0052 1.0037 1.0033
dispcorr: -0.020798178 hartree
energy: -2218.063911158708
dipole: -1.90208 0.71783 -1.18426 18.22463 -17.59128 0.63336 -8.58792 8.11806 -0.46986
magnitude: 1.42280 au
magnitude: 3.61648 debye
