program: Orca
programVersion: 5.0.2
elementType: Cl Cl S O O O O N C C C C C C C C C C C C C C H H H H H H H H H H H H H H H H H
charge: 0
multiplicity: 1
keywords: wb97x-d3
keywords: def2-TZVPP
keywords: def2/J RIJCOSX
keywords: DEFGRID2
keywords: scfconv7
keywords: smallprint printgap noloewdin
keywords: NOSOSCF
formula: C14H17Cl2NO4S
InChI: InChI=1/C14H17Cl2NO4S/c1-4-20-12-6-10(15)9(5-11(12)16)8-22(18,19)13-7-14(2,3)21-17-13/h5-6H,4,7-8H2,1-3H3
39 atoms
Cl 0.659842 -3.513252 -0.546978
Cl -3.137814 1.010461 1.335685
S  2.582019 -0.280102 -0.238797
O  1.583509 3.243341 0.933989
O  2.058723 -0.634676 -1.544787
O  3.986033 -0.467848 0.077037
O  -3.895344 -1.296905 -0.183193
N  1.766543 1.915122 1.038781
C  2.117958 3.732812 -0.3346
C  2.409865 2.446962 -1.130088
C  2.222414 1.446547 -0.043676
C  3.389692 4.503602 -0.024505
C  1.056104 4.606925 -0.971947
C  1.602125 -1.070994 1.067199
C  0.156671 -1.171975 0.721525
C  -0.362591 -2.229642 -0.014321
C  -0.735044 -0.182321 1.132323
C  -2.074715 -0.238763 0.817598
C  -1.710596 -2.308328 -0.330511
C  -2.587522 -1.310247 0.077339
C  -4.47263 -2.374889 -0.897667
C  -5.95183 -2.104174 -1.032693
H  1.707966 2.26514 -1.947507
H  3.416772 2.427386 -1.550099
H  4.133486 3.865775 0.455112
H  3.827222 4.89679 -0.942883
H  3.186045 5.344682 0.63833
H  0.81106 5.457002 -0.334919
H  1.413834 4.997245 -1.925117
H  0.140509 4.045591 -1.158062
H  1.774875 -0.492954 1.975333
H  2.078877 -2.044704 1.193127
H  -0.366194 0.654529 1.709843
H  -2.060071 -3.155955 -0.901675
H  -4.303171 -3.316731 -0.363025
H  -4.008714 -2.467451 -1.886411
H  -6.424262 -2.917803 -1.581993
H  -6.136252 -1.178457 -1.575868
H  -6.431189 -2.032299 -0.057383
totalener: -2218.01734536 hartree
nucrepener: 2380.15129098 hartree
electener: -4598.16863633 hartree
oneelecener: -7781.85018149 hartree
twoeener: 3183.68154516 hartree
kineticenergy: 2212.09779996 hartree
xcener: -146.622240200370 hartree
chargesum: -0.0000000
charge: -0.054063 -0.057486 0.807257 -0.202838 -0.455299 -0.461426 -0.269976 -0.084323 0.196077 -0.142318 0.003381 -0.284792 -0.257965 -0.211746 -0.033912 -0.020345 -0.103235 -0.026545 -0.144318 0.277392 0.022789 -0.253165 0.109584 0.111558 0.108085 0.085189 0.097478 0.097152 0.087241 0.097458 0.149371 0.151493 0.129353 0.099260 0.087502 0.087133 0.079989 0.089217 0.089791
qa: -0.0541 -0.0575 0.8073 -0.2028 -0.4553 -0.4614 -0.2700 -0.0843 0.1961 -0.1423 0.0034 -0.2848 -0.2580 -0.2117 -0.0339 -0.0203 -0.1032 -0.0265 -0.1443 0.2774 0.0228 -0.2532 0.1096 0.1116 0.1081 0.0852 0.0975 0.0972 0.0872 0.0975 0.1494 0.1515 0.1294 0.0993 0.0875 0.0871 0.0800 0.0892 0.0898
va: 1.2763 1.2596 5.6018 2.0638 2.0258 2.0284 2.1413 2.9235 3.9154 3.9603 3.9089 3.9768 3.9399 3.8100 3.6226 4.1649 3.9530 4.0065 3.8786 3.9236 3.8630 3.9811 1.0220 1.0130 1.0039 1.0053 1.0112 1.0111 1.0044 1.0104 1.0234 1.0260 1.0311 1.0367 0.9845 0.9837 1.0061 1.0061 1.0059
dispcorr: -0.021048034 hartree
energy: -2218.038393389556
dipole: -3.93896 2.83520 -1.10376 18.57930 -17.99581 0.58349 -8.92619 8.42687 -0.49931
magnitude: 1.34464 au
magnitude: 3.41780 debye
