program: Orca
programVersion: 5.0.2
elementType: Cl Cl S O O O O N C C C C C C C C C C C C C C H H H H H H H H H H H H H H H H H
charge: 0
multiplicity: 1
keywords: wb97x-d3
keywords: def2-TZVPP
keywords: def2/J RIJCOSX
keywords: DEFGRID2
keywords: scfconv7
keywords: smallprint printgap noloewdin
keywords: NOSOSCF
formula: C14H17Cl2NO4S
InChI: InChI=1/C14H17Cl2NO4S/c1-4-20-12-6-10(15)9(5-11(12)16)8-22(18,19)13-7-14(2,3)21-17-13/h5-6H,4,7-8H2,1-3H3
39 atoms
Cl 0.469968 -3.445713 -0.789019
Cl -2.979569 1.244054 1.3397
S  2.605668 -0.377876 -0.21579
O  1.751824 3.100862 1.170347
O  2.11163 -0.663215 -1.550618
O  3.994697 -0.606613 0.132672
O  -3.886257 -0.856112 -0.375381
N  1.998707 1.782521 1.210975
C  1.77903 3.590936 -0.20834
C  2.178517 2.353889 -1.035635
C  2.229406 1.338482 0.049257
C  2.810015 4.700453 -0.278242
C  0.379297 4.077175 -0.538124
C  1.571557 -1.212067 1.018755
C  0.129059 -1.175258 0.650918
C  -0.45579 -2.124254 -0.17864
C  -0.688258 -0.146551 1.115041
C  -2.017604 -0.061317 0.762503
C  -1.795762 -2.063086 -0.529007
C  -2.598298 -1.02415 -0.071057
C  -4.575798 -1.827638 -1.143722
C  -4.976445 -3.043148 -0.33107
H  1.447385 2.088567 -1.800743
H  3.145744 2.462588 -1.532069
H  2.866943 5.096617 -1.292647
H  2.550671 5.523081 0.388267
H  3.800077 4.33665 -0.001877
H  0.079405 4.89094 0.122256
H  0.34099 4.445494 -1.563957
H  -0.353055 3.274242 -0.44064
H  1.775531 -0.72304 1.97172
H  1.975643 -2.224777 1.065382
H  -0.27041 0.608123 1.767982
H  -2.194731 -2.835216 -1.170475
H  -3.993882 -2.110868 -2.027162
H  -5.464345 -1.311362 -1.505668
H  -5.596349 -2.753918 0.516682
H  -4.118058 -3.594671 0.051818
H  -5.556408 -3.72455 -0.953937
totalener: -2218.01437018 hartree
nucrepener: 2413.30262837 hartree
electener: -4631.31699855 hartree
oneelecener: -7847.97710048 hartree
twoeener: 3216.66010193 hartree
kineticenergy: 2212.09970627 hartree
xcener: -146.624017153146 hartree
chargesum: -0.0000000
charge: -0.052051 -0.060674 0.814547 -0.198072 -0.460266 -0.456682 -0.277343 -0.067566 0.199547 -0.124704 -0.035442 -0.269902 -0.268331 -0.225699 -0.016165 -0.010812 -0.134460 -0.020472 -0.149497 0.277888 0.004536 -0.242187 0.109141 0.110308 0.087825 0.096573 0.101247 0.096733 0.086748 0.096052 0.152885 0.145568 0.133264 0.101510 0.080586 0.108403 0.094422 0.087605 0.084937
qa: -0.0521 -0.0607 0.8145 -0.1981 -0.4603 -0.4567 -0.2773 -0.0676 0.1995 -0.1247 -0.0354 -0.2699 -0.2683 -0.2257 -0.0162 -0.0108 -0.1345 -0.0205 -0.1495 0.2779 0.0045 -0.2422 0.1091 0.1103 0.0878 0.0966 0.1012 0.0967 0.0867 0.0961 0.1529 0.1456 0.1333 0.1015 0.0806 0.1084 0.0944 0.0876 0.0849
va: 1.2783 1.2543 5.5943 2.0640 2.0233 2.0355 2.1361 2.9270 3.8912 3.9337 3.9450 3.9526 3.9756 3.8396 3.6017 4.1310 3.9655 3.9916 3.8743 3.9115 3.9103 3.9109 1.0240 1.0113 1.0043 1.0114 1.0072 1.0118 1.0054 1.0081 1.0212 1.0284 1.0236 1.0318 0.9945 0.9937 1.0056 1.0045 1.0117
dispcorr: -0.022410719 hartree
energy: -2218.036780896015
dipole: -5.75701 4.19712 -1.55990 15.44009 -14.94739 0.49270 -6.90893 6.34531 -0.56362
magnitude: 1.73023 au
magnitude: 4.39789 debye
