program: Orca
programVersion: 5.0.2
elementType: Cl Cl S O O O O N C C C C C C C C C C C C C C H H H H H H H H H H H H H H H H H
charge: 0
multiplicity: 1
keywords: wb97x-d3
keywords: def2-TZVPP
keywords: def2/J RIJCOSX
keywords: DEFGRID2
keywords: scfconv7
keywords: smallprint printgap noloewdin
keywords: NOSOSCF
formula: C14H17Cl2NO4S
InChI: InChI=1/C14H17Cl2NO4S/c1-4-20-12-6-10(15)9(5-11(12)16)8-22(18,19)13-7-14(2,3)21-17-13/h5-6H,4,7-8H2,1-3H3
39 atoms
Cl -0.53818 1.889155 1.588549
Cl -1.776531 -3.872473 -0.338444
S  2.793105 -0.222936 0.578458
O  2.182603 3.375483 -0.53929
O  2.694412 -1.279336 -0.41566
O  4.009812 0.015299 1.325818
O  -3.585336 -1.662178 -0.38673
N  2.621444 2.384138 0.24257
C  1.648639 2.846717 -1.795542
C  1.560804 1.331906 -1.542937
C  2.318666 1.262165 -0.26274
C  2.65382 3.181745 -2.884534
C  0.301717 3.499655 -2.030104
C  1.476537 -0.464365 1.797502
C  0.137534 -0.71049 1.190834
C  -0.842753 0.264941 1.075288
C  -0.17879 -1.987068 0.722837
C  -1.417593 -2.281501 0.201522
C  -2.09767 -0.010783 0.548237
C  -2.406811 -1.292823 0.112751
C  -4.628667 -0.709571 -0.488329
C  -5.835711 -1.404298 -1.07104
H  0.535759 0.970751 -1.421256
H  2.022434 0.738742 -2.332854
H  2.797934 4.25901 -2.968107
H  3.623346 2.724622 -2.681637
H  2.304177 2.811796 -3.849082
H  -0.137019 3.129846 -2.957378
H  -0.386785 3.278139 -1.214683
H  0.39712 4.582439 -2.114153
H  1.502323 0.401314 2.45842
H  1.816616 -1.330898 2.370355
H  0.565496 -2.769839 0.776846
H  -2.8252 0.786211 0.496204
H  -4.319249 0.12326 -1.13077
H  -4.862687 -0.297532 0.500114
H  -6.170381 -2.219319 -0.430922
H  -5.619482 -1.809113 -2.058769
H  -6.65565 -0.693628 -1.169299
totalener: -2218.01503458 hartree
nucrepener: 2423.31037070 hartree
electener: -4641.32540528 hartree
oneelecener: -7867.47844429 hartree
twoeener: 3226.15303901 hartree
kineticenergy: 2212.09881720 hartree
xcener: -146.622439275983 hartree
chargesum: 0.0000000
charge: -0.053945 -0.049805 0.817191 -0.181544 -0.473906 -0.448652 -0.267202 0.017695 0.198070 -0.107145 -0.142313 -0.284261 -0.253676 -0.203436 -0.012570 -0.109326 -0.073547 -0.025725 -0.101362 0.269933 0.020737 -0.252433 0.098829 0.119055 0.097813 0.108980 0.083972 0.087231 0.084593 0.098695 0.152585 0.137337 0.109690 0.102436 0.085049 0.088979 0.090986 0.090605 0.080387
qa: -0.0539 -0.0498 0.8172 -0.1815 -0.4739 -0.4487 -0.2672 0.0177 0.1981 -0.1071 -0.1423 -0.2843 -0.2537 -0.2034 -0.0126 -0.1093 -0.0735 -0.0257 -0.1014 0.2699 0.0207 -0.2524 0.0988 0.1191 0.0978 0.1090 0.0840 0.0872 0.0846 0.0987 0.1526 0.1373 0.1097 0.1024 0.0850 0.0890 0.0910 0.0906 0.0804
va: 1.2757 1.2642 5.6177 2.0760 2.0084 2.0597 2.1459 2.9574 3.9084 3.9142 4.0040 3.9778 3.9322 3.8408 3.5485 4.0751 4.0414 4.0071 3.7944 3.9341 3.8632 3.9815 1.0145 1.0244 1.0114 1.0036 1.0052 1.0051 1.0218 1.0124 1.0275 1.0148 1.0358 1.0361 0.9841 0.9841 1.0060 1.0058 1.0060
dispcorr: -0.023266034 hartree
energy: -2218.038300613598
dipole: -12.27229 9.64292 -2.62937 15.72977 -15.04298 0.68679 -18.14215 17.22582 -0.91633
magnitude: 2.86792 au
magnitude: 7.28966 debye
