program: Orca
programVersion: 5.0.2
elementType: Cl Cl S O O O O N C C C C C C C C C C C C C C H H H H H H H H H H H H H H H H H
charge: 0
multiplicity: 1
keywords: wb97x-d3
keywords: def2-TZVPP
keywords: def2/J RIJCOSX
keywords: DEFGRID2
keywords: scfconv7
keywords: smallprint printgap noloewdin
keywords: NOSOSCF
formula: C14H17Cl2NO4S
InChI: InChI=1/C14H17Cl2NO4S/c1-4-20-12-6-10(15)9(5-11(12)16)8-22(18,19)13-7-14(2,3)21-17-13/h5-6H,4,7-8H2,1-3H3
39 atoms
Cl 0.454075 -3.404016 -0.888923
Cl -2.855563 1.281233 1.459063
S  2.682935 -0.430948 -0.159443
O  1.734239 3.04078 1.167942
O  2.254061 -0.756979 -1.507234
O  4.059401 -0.608599 0.258379
O  -3.805751 -0.673815 -0.394661
N  2.124076 1.759882 1.224904
C  1.487297 3.44801 -0.218006
C  1.873326 2.206252 -1.044325
C  2.209908 1.269836 0.061476
C  2.373208 4.645227 -0.504662
C  0.010621 3.780197 -0.332162
C  1.62054 -1.289409 1.033972
C  0.18233 -1.194178 0.657295
C  -0.425622 -2.07717 -0.227623
C  -0.606107 -0.1664 1.171291
C  -1.928447 -0.017216 0.812998
C  -1.757405 -1.946036 -0.591788
C  -2.529565 -0.906698 -0.084953
C  -4.505395 -1.545145 -1.26712
C  -4.97235 -2.81496 -0.583769
H  1.056769 1.826266 -1.660572
H  2.726393 2.377097 -1.704883
H  2.140693 5.476467 0.161009
H  3.427207 4.394648 -0.381989
H  2.224231 4.985391 -1.529967
H  -0.262118 4.597936 0.335016
H  -0.227177 4.085085 -1.351962
H  -0.613456 2.920201 -0.085329
H  1.829085 -0.842818 2.006473
H  1.994802 -2.314738 1.042678
H  -0.171968 0.534927 1.871592
H  -2.174474 -2.666063 -1.280697
H  -3.906863 -1.766405 -2.157144
H  -5.364907 -0.965641 -1.60228
H  -4.147403 -3.438859 -0.241388
H  -5.566207 -3.406362 -1.281127
H  -5.598736 -2.58313 0.276596
totalener: -2218.01345349 hartree
nucrepener: 2433.41133410 hartree
electener: -4651.42478760 hartree
oneelecener: -7888.04745936 hartree
twoeener: 3236.62267176 hartree
kineticenergy: 2212.09645812 hartree
xcener: -146.623303779928 hartree
chargesum: -0.0000000
charge: -0.048324 -0.060551 0.819470 -0.194274 -0.463242 -0.452703 -0.276719 -0.050007 0.197552 -0.114642 -0.065891 -0.272165 -0.253832 -0.231185 -0.004604 -0.007079 -0.152546 -0.026538 -0.146830 0.284306 0.005236 -0.242280 0.107013 0.112220 0.096887 0.101280 0.087983 0.097112 0.087471 0.081260 0.153164 0.140492 0.134461 0.101307 0.080416 0.108682 0.087402 0.085495 0.094202
qa: -0.0483 -0.0606 0.8195 -0.1943 -0.4632 -0.4527 -0.2767 -0.0500 0.1976 -0.1146 -0.0659 -0.2722 -0.2538 -0.2312 -0.0046 -0.0071 -0.1525 -0.0265 -0.1468 0.2843 0.0052 -0.2423 0.1070 0.1122 0.0969 0.1013 0.0880 0.0971 0.0875 0.0813 0.1532 0.1405 0.1345 0.1013 0.0804 0.1087 0.0874 0.0855 0.0942
va: 1.2820 1.2554 5.5947 2.0634 2.0212 2.0437 2.1362 2.9347 3.8884 3.9132 3.9729 3.9548 3.9742 3.8588 3.5705 4.1323 3.9598 3.9839 3.8744 3.9118 3.9079 3.9111 1.0242 1.0127 1.0115 1.0070 1.0041 1.0133 1.0070 1.0163 1.0191 1.0297 1.0204 1.0326 0.9950 0.9938 1.0045 1.0114 1.0058
dispcorr: -0.023316737 hartree
energy: -2218.036770228528
dipole: -8.70816 6.78845 -1.91971 15.07767 -14.65038 0.42729 -8.00619 7.31708 -0.68912
magnitude: 2.08392 au
magnitude: 5.29692 debye
