program: Orca
programVersion: 5.0.2
elementType: S O O O O O C C C C C C C C C C C C C H H H H H H H H H H H H H H H H H H
charge: 0
multiplicity: 1
keywords: wb97x-d3
keywords: def2-TZVPP
keywords: def2/J RIJCOSX
keywords: DEFGRID2
keywords: scfconv7
keywords: smallprint printgap noloewdin
keywords: NOSOSCF
formula: C13H18O5S
InChI: InChI=1/C13H18O5S/c1-5-16-12-13(2,3)10-8-9(18-19(4,14)15)6-7-11(10)17-12/h6-8,12H,5H2,1-4H3
37 atoms
S  3.716566 0.348924 0.62777
O  -2.558659 0.776344 -0.860237
O  -3.437312 -0.408001 0.91795
O  2.851901 0.027896 -0.708578
O  5.083114 0.154667 0.197333
O  3.308286 1.630928 1.164446
C  -1.914788 -1.502565 -0.61177
C  -3.073309 -0.489955 -0.408344
C  -0.736451 -0.568826 -0.638122
C  -2.072404 -2.161698 -1.986153
C  -1.817465 -2.569174 0.469162
C  -1.205937 0.721822 -0.815536
C  0.618157 -0.813998 -0.577256
C  -0.35967 1.805068 -0.947177
C  1.476856 0.272454 -0.707548
C  1.009123 1.562416 -0.897399
C  -4.718066 0.150759 1.197448
C  -4.718256 1.66035 1.310044
C  3.238604 -0.937827 1.741701
H  -3.940691 -0.712224 -1.038458
H  -2.957208 -2.800671 -2.00589
H  -2.172612 -1.423669 -2.783613
H  -1.204253 -2.781389 -2.212733
H  -1.615591 -2.151558 1.454199
H  -2.73196 -3.16104 0.525748
H  -1.002668 -3.253756 0.229309
H  1.008311 -1.816107 -0.4453
H  -0.73627 2.808639 -1.088764
H  1.702235 2.383565 -1.019208
H  -5.439837 -0.17634 0.441189
H  -5.027736 -0.287999 2.146674
H  -5.69088 1.989551 1.676171
H  -3.965484 2.004963 2.019718
H  -4.543673 2.152512 0.354561
H  3.467429 -1.904606 1.298995
H  3.814316 -0.805504 2.657285
H  2.177529 -0.861172 1.969671
elementType: S O C H
totalener: -1280.64914779 hartree
nucrepener: 1697.13190240 hartree
electener: -2977.78105019 hartree
oneelecener: -5126.10217898 hartree
twoeener: 2148.32112880 hartree
cpcmener: -0.03874837 hartree
kineticenergy: 1275.93037564 hartree
xcener: -102.309493295204 hartree
chargesum: 0.0000000
charge: 0.885206 -0.346864 -0.367967 -0.316615 -0.518240 -0.509161 0.361271 0.212817 -0.139280 -0.329834 -0.331831 0.164751 -0.197725 -0.239468 0.179368 -0.122662 0.048045 -0.261758 -0.242158 0.102544 0.106399 0.113682 0.101525 0.100307 0.107321 0.103461 0.157688 0.150826 0.148561 0.073156 0.096183 0.094517 0.083749 0.082414 0.146140 0.155791 0.147841
qa: 0.8852 -0.3469 -0.3680 -0.3166 -0.5182 -0.5092 0.3613 0.2128 -0.1393 -0.3298 -0.3318 0.1648 -0.1977 -0.2395 0.1794 -0.1227 0.0480 -0.2618 -0.2422 0.1025 0.1064 0.1137 0.1015 0.1003 0.1073 0.1035 0.1577 0.1508 0.1486 0.0732 0.0962 0.0945 0.0837 0.0824 0.1461 0.1558 0.1478
va: 5.7914 2.0726 1.9963 2.0331 1.9687 1.9545 3.6075 4.0401 3.6634 3.9405 3.9261 3.9521 4.0084 4.0436 3.8001 3.9770 3.8947 3.9070 3.8708 0.9946 1.0004 0.9994 1.0051 1.0104 1.0049 1.0014 0.9999 1.0023 1.0059 1.0019 0.9908 1.0095 1.0070 1.0115 1.0069 1.0054 1.0003
dispcorr: -0.018494776 hartree
energy: -1280.667642564376
dipole: -27.25713 24.40018 -2.85695 -10.15000 7.93425 -2.21575 3.84075 -3.35844 0.48231
magnitude: 3.64751 au
magnitude: 9.27123 debye
