program: Orca
programVersion: 5.0.2
elementType: S O O O O O C C C C C C C C C C C C C H H H H H H H H H H H H H H H H H H
charge: 0
multiplicity: 1
keywords: wb97x-d3
keywords: def2-TZVPP
keywords: def2/J RIJCOSX
keywords: DEFGRID2
keywords: scfconv7
keywords: smallprint printgap noloewdin
keywords: NOSOSCF
formula: C13H18O5S
InChI: InChI=1/C13H18O5S/c1-5-16-12-13(2,3)10-8-9(18-19(4,14)15)6-7-11(10)17-12/h6-8,12H,5H2,1-4H3
37 atoms
S  3.697858 0.532371 0.676601
O  -2.482584 0.767557 -1.187784
O  -3.520318 -0.104996 0.677522
O  2.814223 -0.311506 -0.399242
O  4.43797 1.541798 -0.04994
O  2.830321 0.936522 1.761421
C  -2.033819 -1.493196 -0.608784
C  -3.115418 -0.384639 -0.606802
C  -0.788948 -0.645605 -0.624212
C  -2.127733 -2.273376 -1.925055
C  -2.118939 -2.448087 0.572174
C  -1.147409 0.637118 -1.00826
C  0.532642 -0.959241 -0.390522
C  -0.21345 1.635874 -1.1951
C  1.480521 0.039837 -0.583718
C  1.125632 1.317128 -0.987514
C  -4.64343 0.759751 0.791664
C  -5.139363 0.720295 2.216417
C  4.793785 -0.752573 1.185416
H  -3.971917 -0.622029 -1.24944
H  -3.05335 -2.851037 -1.966375
H  -2.105465 -1.614052 -2.794541
H  -1.29343 -2.969971 -2.015849
H  -1.96608 -1.948897 1.527627
H  -3.084099 -2.956132 0.600673
H  -1.351688 -3.218159 0.476831
H  0.835867 -1.952452 -0.081414
H  -0.499407 2.634691 -1.497175
H  1.878692 2.076894 -1.153388
H  -4.371896 1.783618 0.514753
H  -5.434867 0.435578 0.1044
H  -5.998001 1.383686 2.323131
H  -5.455555 -0.283618 2.502709
H  -4.373422 1.054551 2.91738
H  5.516809 -0.309568 1.869502
H  4.23593 -1.534599 1.694522
H  5.315727 -1.154911 0.319957
elementType: S O C H
totalener: -1280.65154265 hartree
nucrepener: 1684.01146379 hartree
electener: -2964.66300644 hartree
oneelecener: -5100.63377816 hartree
twoeener: 2135.97077172 hartree
cpcmener: -0.03089662 hartree
kineticenergy: 1275.93764780 hartree
xcener: -102.308289714752 hartree
chargesum: 0.0000000
charge: 0.863882 -0.340121 -0.347244 -0.315830 -0.500590 -0.496832 0.349716 0.224789 -0.182418 -0.327988 -0.332691 0.168369 -0.152437 -0.246742 0.155367 -0.088813 0.042636 -0.251767 -0.216702 0.100631 0.103908 0.113657 0.100270 0.102136 0.106327 0.101620 0.140736 0.145663 0.145043 0.081905 0.072611 0.086089 0.082231 0.086661 0.142064 0.140956 0.142909
qa: 0.8639 -0.3401 -0.3472 -0.3158 -0.5006 -0.4968 0.3497 0.2248 -0.1824 -0.3280 -0.3327 0.1684 -0.1524 -0.2467 0.1554 -0.0888 0.0426 -0.2518 -0.2167 0.1006 0.1039 0.1137 0.1003 0.1021 0.1063 0.1016 0.1407 0.1457 0.1450 0.0819 0.0726 0.0861 0.0822 0.0867 0.1421 0.1410 0.1429
va: 5.7841 2.0871 2.0250 2.0352 1.9740 1.9688 3.6339 4.0392 3.7206 3.9394 3.9268 3.9514 4.0254 4.0661 3.8210 3.9529 3.8830 3.9575 3.8785 0.9952 1.0014 0.9997 1.0054 1.0103 1.0047 1.0012 1.0116 1.0054 1.0129 0.9921 0.9937 1.0084 1.0044 1.0035 1.0055 1.0074 1.0075
dispcorr: -0.017446089 hartree
energy: -1280.668988736988
dipole: -23.52134 22.76240 -0.75894 -11.51112 9.31468 -2.19644 3.79453 -3.90245 -0.10792
magnitude: 2.32637 au
magnitude: 5.91316 debye
