program: Orca
programVersion: 5.0.2
elementType: S O O O O O C C C C C C C C C C C C C H H H H H H H H H H H H H H H H H H
charge: 0
multiplicity: 1
keywords: wb97x-d3
keywords: def2-TZVPP
keywords: def2/J RIJCOSX
keywords: DEFGRID2
keywords: scfconv7
keywords: smallprint printgap noloewdin
keywords: NOSOSCF
formula: C13H18O5S
InChI: InChI=1/C13H18O5S/c1-5-16-12-13(2,3)10-8-9(18-19(4,14)15)6-7-11(10)17-12/h6-8,12H,5H2,1-4H3
37 atoms
S  3.816494 -0.257504 0.07402
O  -2.400979 0.807438 -1.194558
O  -3.766975 -0.174236 0.380302
O  2.631728 0.502055 0.900396
O  4.887664 -0.376059 1.0243
O  3.267642 -1.405827 -0.604637
C  -1.839092 -1.368778 -0.412801
C  -3.008969 -0.405082 -0.739749
C  -0.733898 -0.37166 -0.188428
C  -1.515043 -2.20812 -1.654014
C  -2.103266 -2.274793 0.782027
C  -1.145012 0.849853 -0.699672
C  0.527332 -0.522242 0.34072
C  -0.324615 1.959273 -0.694385
C  1.36785 0.587247 0.341046
C  0.953925 1.808713 -0.165654
C  -4.949778 0.572592 0.172713
C  -5.768564 0.536742 1.442126
C  4.240418 0.969498 -1.144923
H  -3.632428 -0.763247 -1.571272
H  -2.323859 -2.908192 -1.87352
H  -1.356736 -1.58529 -2.535437
H  -0.605104 -2.786917 -1.49477
H  -2.972567 -2.910668 0.611249
H  -1.247216 -2.932763 0.940026
H  -2.267722 -1.711061 1.69715
H  0.862891 -1.467331 0.746532
H  -0.65869 2.912126 -1.080947
H  1.624263 2.657748 -0.124409
H  -4.713653 1.606824 -0.097914
H  -5.523169 0.14407 -0.661443
H  -6.041801 -0.483741 1.708956
H  -5.220046 0.972781 2.276495
H  -6.686579 1.108621 1.308735
H  4.571807 1.876248 -0.645472
H  5.052549 0.562616 -1.744709
H  3.383044 1.170435 -1.783298
totalener: -1280.63229334 hartree
nucrepener: 1692.56646403 hartree
electener: -2973.19875737 hartree
oneelecener: -5116.46314322 hartree
twoeener: 2143.26438585 hartree
kineticenergy: 1275.98245688 hartree
xcener: -102.312035518342 hartree
chargesum: -0.0000000
charge: 0.844179 -0.303621 -0.301783 -0.301879 -0.430747 -0.442105 0.266002 0.221317 -0.148402 -0.306426 -0.292649 0.157437 -0.086421 -0.203857 0.147879 -0.138720 0.027162 -0.236475 -0.295200 0.073248 0.091865 0.109840 0.099819 0.091935 0.090290 0.109838 0.118038 0.120842 0.132010 0.084528 0.053994 0.079969 0.087819 0.075619 0.132761 0.140487 0.131405
qa: 0.8442 -0.3036 -0.3018 -0.3019 -0.4307 -0.4421 0.2660 0.2213 -0.1484 -0.3064 -0.2926 0.1574 -0.0864 -0.2039 0.1479 -0.1387 0.0272 -0.2365 -0.2952 0.0732 0.0919 0.1098 0.0998 0.0919 0.0903 0.1098 0.1180 0.1208 0.1320 0.0845 0.0540 0.0800 0.0878 0.0756 0.1328 0.1405 0.1314
va: 5.8541 2.1269 2.0558 2.0476 2.0715 2.0253 3.8136 4.0556 3.7075 3.9412 3.9287 4.0393 4.0221 4.0665 3.9313 3.9822 3.9139 3.9585 3.9115 0.9983 1.0028 1.0019 1.0092 1.0096 1.0040 1.0119 1.0238 1.0117 1.0007 0.9918 0.9950 1.0061 1.0055 1.0098 1.0086 1.0113 1.0035
dispcorr: -0.018080112 hartree
energy: -1280.650373447374
dipole: -25.87659 24.54426 -1.33233 -2.98354 3.81118 0.82764 -2.55095 1.49218 -1.05878
magnitude: 1.89238 au
magnitude: 4.81004 debye
