program: Gaussian 09
title: 000055953
version: EM64L-G09RevD.01
frameworkgroup: C1[X(C10H9F3N2O2)]
method: RPBEPBE
basis: SDD
operation: Freq
keyword: #p
keyword: freq=noraman
keyword: PBEPBE/SDD
title: #p freq=noraman PBEPBE/SDD
converged: YES YES NO NO
title: Mulliken charges:
elementType: F F F O O N N C C C C C C C C C C H H H H H H H H H
charge: -0.138585 -0.171945 -0.137944 -0.276880 -0.224994 -0.433312 0.017761 0.193078 -0.080740 0.214222 0.109662 0.221472 -0.336651 -0.370261 0.256733 -0.528425 -0.534256 0.352762 0.238855 0.240360 0.225240 0.225094 0.246059 0.251852 0.220462 0.220382
chargesum: 0.00000
title: Mulliken charges with hydrogens summed into heavy atoms:
elementType: F F F O O N N C C C C C C C C C C
charge: -0.138585 -0.171945 -0.137944 -0.276880 -0.224994 -0.080550 0.017761 0.193078 -0.080740 0.214222 0.109662 0.221472 -0.097796 -0.129901 0.256733 0.167968 0.158439
polarizability: 1.74051457e+02 -2.31358775e+00 1.67519242e+02 8.48629907e-02 8.50926104e-03 6.91241622e+01
1716.lowfreq: -4.4973 -2.7723 -0.0011 -0.0007 -0.0006 1.0726 10.6179 63.9268 88.6984
frequency: 10.4368 63.9061 88.6930 96.0126 97.9685 143.1898 155.5005 203.0123 210.5524 229.6987 232.6504 249.0838 278.2752 310.5259 355.3256 357.0277 383.9918 397.0571 481.5625 485.7365 498.9914 556.5777 578.1626 608.0549 631.9092 660.5660 677.0015 695.5927 702.6693 706.9727 783.7342 796.1137 885.4279 916.4076 936.5196 944.0305 1003.2619 1011.1875 1066.3276 1078.7505 1095.9764 1113.7372 1116.2130 1148.0537 1159.4907 1205.1939 1236.6419 1248.6117 1252.9289 1323.4792 1357.4293 1387.4998 1427.1131 1435.8606 1442.2832 1465.5880 1468.0199 1471.1057 1475.4738 1505.3401 1518.6312 1610.6927 1641.5987 2960.0281 2964.2640 3048.1944 3053.1878 3130.0896 3131.8045 3153.5605 3173.7317 3597.7026
redmass: 14.7155 4.4652 4.3039 7.6001 3.4864 4.0308 3.7128 3.2494 7.1521 1.3976 4.9867 1.2091 6.6633 4.0161 6.7763 10.3677 8.9095 4.8899 6.2906 12.0177 11.7723 8.1627 4.4156 3.7066 10.8868 3.8555 1.3455 6.7745 5.1454 8.2102 1.6317 5.2857 1.4180 11.0458 8.0567 7.4063 12.3111 12.8779 6.6943 4.7067 2.3374 1.2592 1.2568 1.5213 1.3693 2.0286 1.9270 2.4483 4.4585 3.1859 6.1003 7.6499 2.6354 1.2142 1.4942 1.0499 1.0498 1.0643 1.0550 5.6837 3.8438 8.4397 9.0465 1.0331 1.0327 1.1040 1.1042 1.0999 1.0993 1.0873 1.0942 1.0819
irintensity: 0.0020 4.7141 0.5418 0.0505 1.2078 10.1869 0.6405 3.4750 8.0984 0.4607 1.9639 0.6093 4.6256 6.8412 0.0063 2.0905 4.8711 0.0024 14.6543 0.5651 1.4920 2.4150 0.8015 0.3709 10.8681 30.3408 109.7172 15.6470 1.4775 1.3583 48.5848 13.7200 0.0029 63.7812 37.3793 2.0011 253.9875 262.7799 71.4261 144.2747 93.8235 0.1170 0.0675 0.8965 11.3114 4.6202 163.8174 278.8467 98.3631 123.8651 56.2749 46.5732 6.1199 8.8044 8.4757 14.9203 14.5737 71.2608 19.5104 158.0470 186.8653 0.5168 7.2933 68.5441 66.2748 47.4247 46.6050 21.8656 17.1267 12.9080 8.6140 110.4181
temp: 298.150 k
press: 1.00000 atm
elementType: 9 9 9 8 8 7 7 6 6 6 6 6 6 6 6 6 6 1 1 1 1 1 1 1 1 1
symmnumber: 1
zpe: 477836.3 jmol-1
zpe.correction: 0.181998 hartree
zpe.thermalcorrener: 0.197588 hartree
zpe.thermalcorrenthalpy: 0.198532 hartree
zpe.thermalcorrgfe: 0.137547 hartree
zpe.sumelectzpe: -944.668449 hartree
zpe.sumelectthermal: -944.652860 hartree
zpe.sumelectthermalent: -944.651915 hartree
zpe.sumelectthermalfe: -944.712901 hartree
dipole: 7.0269 3.3861 -0.0140
dipole: 7.8002
quadrupole: -88.2603 -83.2763 -99.9749
quadrupole: -5.0573 0.0005 -0.0337
quadrupole: 2.2435 7.2276 -9.4711 -5.0573 0.0005 -0.0337
hfenergy: -944.8504474 hartree
pointgroup: C01 [X(C10H9F3N2O2)]
dipole: -2.5275597 1.7188635 0.2733047 debye
dipolederiv: -0.6848723 0.1333193 0.1840317 0.2596833 -0.3819207 -0.2166504 0.275555 -0.2095885 -0.6842066 -0.6320142 -0.1847216 0.0166106 -0.2134936 -0.6761944 -0.0032062 0.0173268 -0.0047356 -0.2954597 -0.7463328 0.182993 -0.1558796 0.3173537 -0.4228778 0.1945472 -0.229117 0.2063593 -0.5753998 -0.3885336 -0.0060201 0.0087643 0.1895204 -1.7473513 -0.0773541 0.0178887 -0.0604944 -0.2801151 -0.5347467 -0.4209792 0.0044052 -0.6840952 -1.5737693 0.000056 -0.0053752 -0.0196175 -0.2602599 -0.391411 -0.0507468 0.0109275 -0.3687575 -0.5016675 0.0170917 -0.0008161 -0.0070815 -0.2243465 -0.1507301 -0.1260565 -0.0080368 0.046357 -0.371478 -0.010632 -0.0005753 0.0021487 -0.1925136 0.3500617 0.23961 -0.0119302 -0.0577517 -0.2222309 -0.0080285 -0.0241942 -0.0312606 0.0679492 0.1083586 -0.1785461 -0.0158693 0.083434 -0.1379462 -0.0115412 -0.0050701 0.0088566 -0.0066465 -0.0499963 0.2327571 0.0171582 -0.0345377 1.4041965 0.0605485 0.0047351 0.0381689 0.0323643 -0.6633572 0.1100156 0.0493421 0.05314 0.6095318 0.0237704 0.0423094 0.0197961 -0.0813272 0.1730597 0.0397955 -0.0063108 0.6123305 1.4795095 0.0088364 0.0162066 0.0527582 0.0703717 -0.0414251 -0.1800016 -0.0185502 0.1808626 -0.0014903 -0.0066029 -0.0029739 0.0214363 -0.1854472 -0.0082022 0.3105057 -0.003131 -0.1415553 -0.3452433 0.0058648 -0.0213168 -0.0284375 -0.2168481 2.5140502 -0.1916028 -0.0799856 -0.3636302 1.4452113 0.0225901 -0.0933056 0.0098145 1.5889148 0.3765608 -0.4949761 -0.0251275 -0.1570635 0.6969215 0.0283512 -0.0110124 0.0552218 0.3305985 0.6337588 0.5390639 -0.0019439 0.2057961 0.472049 -0.0097411 -0.0155528 -0.0359659 0.3264621 0.2877931 0.0296178 0.0060095 0.0505114 0.2499619 -0.0080031 0.0068504 -0.0067405 0.3519064 -0.0002157 0.1121176 0.0172241 0.0892623 0.0043804 -0.0132799 0.0161314 -0.015025 0.1648097 -0.0673747 -0.082629 0.0145041 -0.0672182 0.0588179 0.0004814 0.0152451 0.0016823 0.1684721 -0.018446 0.1372789 0.1059699 -0.0266951 0.0428108 0.0678202 0.0975636 -0.020807 -0.1002234 -0.0521814 0.1493422 -0.1019364 -0.0263659 0.0464978 -0.0512602 -0.1083153 0.0096705 -0.0710023 0.0567357 -0.0949203 0.0010416 -0.0346957 -0.1272041 -0.0085389 0.0036454 -0.0039196 0.1244863 0.0821933 0.0176018 0.0036999 -0.0409879 -0.1433731 -0.006624 0.0015849 -0.0110527 0.1243253 -0.0911844 -0.107196 -0.0875327 0.0750223 0.0673016 0.0923485 -0.1058711 0.0327829 -0.0699623 -0.0615483 -0.1156223 0.0765451 0.0535739 0.0755572 -0.0908438 0.1084534 -0.0039699 -0.1069018 unknown
polarizability: 173.9670403|1.5771532|166.8265715|-8.0083963|3.8994485|69.9012491 unknown
InChI: InChI=1S/C10H9F3N2O2/c1-16-5-3-4-6(17-2)8-7(5)14-9(15-8)10(11,12)13/h3-4,14H,1-2H3
charge 0 multiplicity 1
26 atoms
F  3.627662 -1.222158 -1.415532
F  3.898863 0.689303 -0.207208
F  3.803674 -1.335314 0.832727
O  -0.861573 2.980127 0.245888
O  -1.824997 -2.634776 0.091587
N  1.202213 0.884194 0.001098
N  0.865101 -1.380275 -0.065152
C  -0.173791 0.695472 0.099088
C  -0.371008 -0.722037 0.056497
C  -1.234115 1.625596 0.2181
C  1.769502 -0.389802 -0.094287
C  -1.698069 -1.248498 0.136616
C  -2.529084 1.088634 0.294032
C  -2.754937 -0.323262 0.253675
C  3.243453 -0.581866 -0.219008
C  -1.944246 3.959198 0.37784
C  -3.180509 -3.185597 0.175855
H  1.69228 1.77832 0.000465
H  -3.397298 1.748012 0.386185
H  -3.787717 -0.676652 0.317044
H  -2.498627 3.81236 1.324889
H  -2.643581 3.89613 -0.478171
H  -1.4492 4.940951 0.38348
H  -3.047535 -4.275688 0.126744
H  -3.805109 -2.844889 -0.672957
H  -3.666651 -2.90898 1.131804
