program: Orca
programVersion: 5.0.2
elementType: S O N C C C C C C C C C C C C C C C H H H H H H H H H H H H H H H H H H H H H H H
charge: 0
multiplicity: 1
keywords: wb97x-d3
keywords: def2-TZVPP
keywords: def2/J RIJCOSX
keywords: DEFGRID2
keywords: scfconv7
keywords: smallprint printgap noloewdin
keywords: NOSOSCF
formula: C15H23NOS
InChI: InChI=1/C15H23NOS/c1-5-16(13(4)12(2)3)15(17)18-11-14-9-7-6-8-10-14/h6-10,12-13H,5,11H2,1-4H3
41 atoms
S  -0.498174 1.866774 0.48303
O  0.478281 0.519886 -1.561328
N  1.775499 0.491632 0.297482
C  2.830015 -0.329857 -0.327007
C  2.352173 -1.759084 -0.641084
C  3.508984 0.369973 -1.499979
C  3.535765 -2.629699 -1.053903
C  1.636692 -2.383092 0.552135
C  2.019647 0.928971 1.666211
C  0.687843 0.837072 -0.400779
C  2.85146 2.196836 1.741872
C  -1.962308 1.685767 -0.584202
C  -2.756489 0.458054 -0.254167
C  -2.50508 -0.758769 -0.885225
C  -3.754343 0.515676 0.716569
C  -3.230494 -1.892748 -0.54626
C  -4.483308 -0.616223 1.053501
C  -4.220679 -1.826216 0.424777
H  3.585037 -0.424938 0.458031
H  1.655342 -1.726051 -1.482098
H  2.923799 0.330585 -2.417043
H  3.705228 1.416136 -1.262866
H  4.472073 -0.096832 -1.702911
H  4.30646 -2.643579 -0.279054
H  3.212139 -3.659377 -1.213145
H  3.999635 -2.29166 -1.980471
H  0.739929 -1.831898 0.838526
H  1.326003 -3.40296 0.320383
H  2.292136 -2.431642 1.425535
H  1.072069 1.059227 2.189054
H  2.526561 0.115515 2.185129
H  3.830318 2.05729 1.281394
H  2.355744 3.028675 1.240188
H  3.010256 2.478801 2.782805
H  -1.649846 1.714387 -1.626298
H  -2.546556 2.586567 -0.394623
H  -1.741213 -0.823336 -1.648277
H  -3.965007 1.457104 1.210477
H  -3.021969 -2.830585 -1.044778
H  -5.258954 -0.552341 1.805753
H  -4.787235 -2.710414 0.686166
elementType: S O N C H
totalener: -1113.72491651 hartree
nucrepener: 1511.44625850 hartree
electener: -2625.17117500 hartree
oneelecener: -4523.64790028 hartree
twoeener: 1898.47672527 hartree
cpcmener: -0.02351094 hartree
kineticenergy: 1109.65403927 hartree
xcener: -91.215855267032 hartree
chargesum: -0.0000000
charge: -0.129342 -0.540491 -0.095971 0.040375 0.085801 -0.312617 -0.310016 -0.311928 -0.044512 0.298168 -0.256861 -0.057673 0.037722 -0.206684 -0.220666 -0.148796 -0.143591 -0.178584 0.087368 0.045515 0.093375 0.100926 0.106187 0.088544 0.092502 0.097821 0.084106 0.099395 0.088701 0.098322 0.097894 0.092128 0.077752 0.100786 0.125438 0.142590 0.151095 0.142568 0.161064 0.160411 0.161177
qa: -0.1293 -0.5405 -0.0960 0.0404 0.0858 -0.3126 -0.3100 -0.3119 -0.0445 0.2982 -0.2569 -0.0577 0.0377 -0.2067 -0.2207 -0.1488 -0.1436 -0.1786 0.0874 0.0455 0.0934 0.1009 0.1062 0.0885 0.0925 0.0978 0.0841 0.0994 0.0887 0.0983 0.0979 0.0921 0.0778 0.1008 0.1254 0.1426 0.1511 0.1426 0.1611 0.1604 0.1612
va: 2.3091 1.9529 3.1316 3.8322 3.7507 3.9401 3.9455 3.9360 3.8393 4.2733 3.9334 3.7662 3.5810 3.9172 3.9857 3.8994 3.8743 3.9055 0.9992 1.0376 1.0139 1.0035 0.9980 1.0002 1.0045 1.0006 1.0091 1.0062 1.0035 1.0235 0.9984 1.0009 1.0112 1.0084 1.0324 1.0036 1.0163 1.0045 0.9906 0.9893 0.9893
dispcorr: -0.020497996 hartree
energy: -1113.745414503245
dipole: 20.96663 -20.10108 0.86555 -8.92558 8.78511 -0.14047 1.60879 -0.27453 1.33426
magnitude: 1.59661 au
magnitude: 4.05826 debye
