program: Orca
programVersion: 5.0.2
elementType: S O N C C C C C C C C C C C C C C C H H H H H H H H H H H H H H H H H H H H H H H
charge: 0
multiplicity: 1
keywords: wb97x-d3
keywords: def2-TZVPP
keywords: def2/J RIJCOSX
keywords: DEFGRID2
keywords: scfconv7
keywords: smallprint printgap noloewdin
keywords: NOSOSCF
formula: C15H23NOS
InChI: InChI=1/C15H23NOS/c1-5-16(13(4)12(2)3)15(17)18-11-14-9-7-6-8-10-14/h6-10,12-13H,5,11H2,1-4H3
41 atoms
S  -0.46581 2.191808 0.28456
O  0.305751 0.202947 1.815263
N  1.674835 0.616947 0.048342
C  2.481902 -0.587512 0.298295
C  2.144981 -1.692188 -0.723822
C  3.965349 -0.246458 0.345497
C  2.817582 -3.005641 -0.334164
C  0.640623 -1.908486 -0.870865
C  1.957107 1.385058 -1.158552
C  0.594875 0.839683 0.81407
C  2.66484 2.703802 -0.898102
C  -2.03058 1.649913 1.041532
C  -2.533829 0.361163 0.461584
C  -2.904294 0.287754 -0.880519
C  -2.620894 -0.785808 1.244144
C  -3.341339 -0.908087 -1.428651
C  -3.057251 -1.986157 0.696567
C  -3.412816 -2.052641 -0.642414
H  2.197915 -0.952828 1.284681
H  2.543371 -1.392032 -1.699998
H  4.358684 0.04683 -0.62917
H  4.158602 0.561865 1.050346
H  4.539881 -1.108133 0.681344
H  3.904776 -2.933386 -0.313876
H  2.485878 -3.340124 0.65171
H  2.562328 -3.788993 -1.049102
H  0.12156 -1.023857 -1.242916
H  0.445315 -2.712335 -1.582095
H  0.183408 -2.195154 0.078548
H  2.575141 0.766693 -1.807309
H  1.032036 1.552628 -1.712948
H  3.624766 2.549373 -0.406304
H  2.849957 3.213306 -1.843906
H  2.072458 3.373822 -0.274094
H  -2.714243 2.471868 0.821488
H  -1.925629 1.598001 2.123665
H  -2.844461 1.172681 -1.503173
H  -2.344878 -0.742999 2.290107
H  -3.627692 -0.948215 -2.47166
H  -3.111893 -2.870539 1.318104
H  -3.749077 -2.987465 -1.071762
elementType: S O N C H
totalener: -1113.72621611 hartree
nucrepener: 1547.70537010 hartree
electener: -2661.43158621 hartree
oneelecener: -4596.33564258 hartree
twoeener: 1934.90405637 hartree
cpcmener: -0.02541685 hartree
kineticenergy: 1109.65541674 hartree
xcener: -91.220442442248 hartree
chargesum: -0.0000000
charge: -0.122185 -0.534432 -0.106272 0.085199 0.077230 -0.318911 -0.310173 -0.319734 -0.079910 0.298549 -0.249749 -0.054151 0.052094 -0.219826 -0.192511 -0.143898 -0.156840 -0.172642 0.076903 0.043007 0.093968 0.101109 0.107791 0.096065 0.089588 0.092702 0.080471 0.104941 0.085634 0.109028 0.103492 0.093125 0.097648 0.078328 0.146051 0.117081 0.134437 0.137898 0.159752 0.159621 0.159520
qa: -0.1222 -0.5344 -0.1063 0.0852 0.0772 -0.3189 -0.3102 -0.3197 -0.0799 0.2985 -0.2497 -0.0542 0.0521 -0.2198 -0.1925 -0.1439 -0.1568 -0.1726 0.0769 0.0430 0.0940 0.1011 0.1078 0.0961 0.0896 0.0927 0.0805 0.1049 0.0856 0.1090 0.1035 0.0931 0.0976 0.0783 0.1461 0.1171 0.1344 0.1379 0.1598 0.1596 0.1595
va: 2.3082 1.9690 3.1013 3.8071 3.8057 3.9565 3.9480 3.9364 3.8507 4.2844 3.9219 3.8254 3.4920 3.9461 3.9111 3.8752 3.8739 3.8839 1.0422 1.0230 0.9968 1.0053 1.0011 1.0024 1.0006 1.0037 1.0027 1.0081 1.0082 0.9985 1.0198 1.0017 1.0075 1.0140 1.0015 1.0298 1.0143 1.0163 0.9898 0.9907 0.9901
dispcorr: -0.022371799 hartree
energy: -1113.748587911364
dipole: 18.06616 -17.27390 0.79226 -9.22658 9.28131 0.05474 -7.40880 5.86076 -1.54805
magnitude: 1.73986 au
magnitude: 4.42237 debye
