program: Orca
programVersion: 5.0.2
elementType: S O N C C C C C C C C C C C C C C C H H H H H H H H H H H H H H H H H H H H H H H
charge: 0
multiplicity: 1
keywords: wb97x-d3
keywords: def2-TZVPP
keywords: def2/J RIJCOSX
keywords: DEFGRID2
keywords: scfconv7
keywords: smallprint printgap noloewdin
keywords: NOSOSCF
formula: C15H23NOS
InChI: InChI=1/C15H23NOS/c1-5-16(13(4)12(2)3)15(17)18-11-14-9-7-6-8-10-14/h6-10,12-13H,5,11H2,1-4H3
41 atoms
S  -0.465906 2.138157 0.037565
O  0.273308 0.319095 1.783139
N  1.707789 0.597417 0.041466
C  2.53695 -0.549936 0.444536
C  2.263815 -1.769807 -0.459084
C  4.008405 -0.160506 0.497947
C  2.96994 -3.00789 0.08631
C  0.772343 -2.056548 -0.611738
C  2.016407 1.24451 -1.229644
C  0.592559 0.866404 0.738875
C  2.682347 2.602821 -1.091123
C  -2.038269 1.708467 0.847467
C  -2.600519 0.411182 0.347642
C  -2.634873 -0.716436 1.161928
C  -3.081258 0.310602 -0.957358
C  -3.123261 -1.924481 0.678882
C  -3.575699 -0.891299 -1.438865
C  -3.59227 -2.016843 -0.622947
H  2.231125 -0.814938 1.456325
H  2.674783 -1.561643 -1.453844
H  4.156616 0.721144 1.121123
H  4.596417 -0.965318 0.936871
H  4.423404 0.044526 -0.490385
H  2.634526 -3.234147 1.101333
H  2.747594 -3.877066 -0.534149
H  4.053947 -2.89969 0.109372
H  0.227822 -1.233573 -1.077333
H  0.622536 -2.933619 -1.243427
H  0.306158 -2.268446 0.352966
H  2.673301 0.579141 -1.787554
H  1.108427 1.326918 -1.829732
H  2.060209 3.316487 -0.550509
H  3.636928 2.528163 -0.570791
H  2.872873 3.017288 -2.081522
H  -2.693056 2.543836 0.591862
H  -1.913352 1.714893 1.928864
H  -2.280695 -0.653228 2.182522
H  -3.065026 1.180068 -1.603984
H  -3.137928 -2.792831 1.324738
H  -3.947703 -0.951518 -2.453389
H  -3.972772 -2.956992 -1.000354
elementType: S O N C H
totalener: -1113.72655410 hartree
nucrepener: 1538.60822121 hartree
electener: -2652.33477531 hartree
oneelecener: -4578.11570765 hartree
twoeener: 1925.78093234 hartree
cpcmener: -0.02504927 hartree
kineticenergy: 1109.65153633 hartree
xcener: -91.219178782110 hartree
chargesum: 0.0000000
charge: -0.120876 -0.536541 -0.107840 0.089209 0.071741 -0.320322 -0.311643 -0.309802 -0.081589 0.296636 -0.249002 -0.050248 0.048271 -0.202218 -0.213091 -0.155062 -0.148013 -0.170742 0.076575 0.044472 0.101355 0.107710 0.093860 0.089955 0.092815 0.096545 0.078488 0.104177 0.083498 0.109188 0.104577 0.078554 0.092637 0.097793 0.145971 0.118498 0.137339 0.136775 0.159979 0.160317 0.160051
qa: -0.1209 -0.5365 -0.1078 0.0892 0.0717 -0.3203 -0.3116 -0.3098 -0.0816 0.2966 -0.2490 -0.0502 0.0483 -0.2022 -0.2131 -0.1551 -0.1480 -0.1707 0.0766 0.0445 0.1014 0.1077 0.0939 0.0900 0.0928 0.0965 0.0785 0.1042 0.0835 0.1092 0.1046 0.0786 0.0926 0.0978 0.1460 0.1185 0.1373 0.1368 0.1600 0.1603 0.1601
va: 2.3143 1.9633 3.1034 3.8033 3.8009 3.9563 3.9476 3.9337 3.8504 4.2877 3.9181 3.8106 3.5002 3.9052 3.9625 3.8764 3.8854 3.8946 1.0418 1.0226 1.0053 1.0011 0.9967 1.0004 1.0038 1.0020 1.0050 1.0080 1.0091 0.9984 1.0204 1.0155 1.0018 1.0076 1.0018 1.0311 1.0194 1.0112 0.9906 0.9894 0.9894
dispcorr: -0.021793624 hartree
energy: -1113.748347722161
dipole: 18.81685 -17.95646 0.86039 -9.62069 9.58066 -0.04003 -5.63944 4.15803 -1.48141
magnitude: 1.71361 au
magnitude: 4.35565 debye
