program: Orca
programVersion: 5.0.2
elementType: S O N C C C C C C C C C C C C C C C H H H H H H H H H H H H H H H H H H H H H H H
charge: 0
multiplicity: 1
keywords: wb97x-d3
keywords: def2-TZVPP
keywords: def2/J RIJCOSX
keywords: DEFGRID2
keywords: scfconv7
keywords: smallprint printgap noloewdin
keywords: NOSOSCF
formula: C15H23NOS
InChI: InChI=1/C15H23NOS/c1-5-16(13(4)12(2)3)15(17)18-11-14-9-7-6-8-10-14/h6-10,12-13H,5,11H2,1-4H3
41 atoms
S  -0.482762 2.006454 0.107482
O  0.402835 0.198418 1.797425
N  1.760731 0.577952 0.015618
C  2.682919 -0.502423 0.401188
C  2.473805 -1.748256 -0.482271
C  4.12382 -0.00979 0.411673
C  3.294873 -2.920497 0.048695
C  1.004468 -2.149732 -0.575583
C  1.994584 1.254935 -1.255407
C  0.654399 0.774356 0.749467
C  2.588086 2.647591 -1.12149
C  -1.990001 1.557211 1.024078
C  -2.679811 0.367215 0.428163
C  -2.564006 -0.898523 0.997021
C  -3.442824 0.514829 -0.729525
C  -3.188843 -1.994331 0.414374
C  -4.069911 -0.57662 -1.310017
C  -3.940138 -1.838372 -0.74164
H  2.425739 -0.778684 1.423298
H  2.830154 -1.519693 -1.493617
H  4.774355 -0.763894 0.851645
H  4.502455 0.203314 -0.589355
H  4.225272 0.891594 1.015513
H  3.028708 -3.147022 1.084174
H  3.10536 -3.817873 -0.541775
H  4.36789 -2.734149 0.013403
H  0.591117 -2.384673 0.40775
H  0.382516 -1.374291 -1.025599
H  0.897898 -3.042186 -1.194044
H  2.669628 0.632067 -1.840199
H  1.066099 1.291489 -1.82833
H  3.562319 2.621612 -0.634354
H  2.721137 3.083002 -2.112145
H  1.945537 3.318814 -0.551412
H  -2.617127 2.446786 0.952482
H  -1.745466 1.415601 2.074981
H  -1.991233 -1.032392 1.905111
H  -3.548222 1.495193 -1.179636
H  -3.087005 -2.971765 0.868061
H  -4.663542 -0.442644 -2.205029
H  -4.427441 -2.692153 -1.194148
elementType: S O N C H
totalener: -1113.72697143 hartree
nucrepener: 1523.64205445 hartree
electener: -2637.36902588 hartree
oneelecener: -4548.06763850 hartree
twoeener: 1910.69861261 hartree
cpcmener: -0.02438298 hartree
kineticenergy: 1109.65368631 hartree
xcener: -91.219310816686 hartree
chargesum: -0.0000000
charge: -0.120059 -0.540659 -0.107911 0.088205 0.069668 -0.322762 -0.310305 -0.305958 -0.079662 0.296985 -0.250447 -0.050585 0.059960 -0.227759 -0.220472 -0.144413 -0.146771 -0.174540 0.076575 0.043880 0.108523 0.094816 0.102137 0.089937 0.092188 0.095924 0.081939 0.081171 0.103325 0.109355 0.103715 0.093690 0.097663 0.078788 0.145848 0.122190 0.143832 0.140816 0.160390 0.160387 0.160398
qa: -0.1201 -0.5407 -0.1079 0.0882 0.0697 -0.3228 -0.3103 -0.3060 -0.0797 0.2970 -0.2504 -0.0506 0.0600 -0.2278 -0.2205 -0.1444 -0.1468 -0.1745 0.0766 0.0439 0.1085 0.0948 0.1021 0.0899 0.0922 0.0959 0.0819 0.0812 0.1033 0.1094 0.1037 0.0937 0.0977 0.0788 0.1458 0.1222 0.1438 0.1408 0.1604 0.1604 0.1604
va: 2.3175 1.9538 3.1076 3.8004 3.7979 3.9553 3.9477 3.9302 3.8482 4.2858 3.9131 3.7826 3.5201 3.9078 3.9851 3.8708 3.8828 3.9042 1.0422 1.0226 1.0007 0.9963 1.0047 1.0004 1.0040 1.0018 1.0102 1.0055 1.0075 0.9987 1.0213 1.0016 1.0078 1.0167 1.0020 1.0335 1.0194 1.0069 0.9904 0.9892 0.9891
dispcorr: -0.021030769 hartree
energy: -1113.748002201400
dipole: 19.74016 -18.91302 0.82713 -8.76996 8.83457 0.06461 -5.87210 4.40572 -1.46639
magnitude: 1.68482 au
magnitude: 4.28247 debye
