program: Gaussian 09
title: 000006400
version: EM64L-G09RevD.01
frameworkgroup: C1[X(C2H3Br3O)]
method: RPBEPBE
basis: SDD
operation: Freq
keyword: #p
keyword: freq=noraman
keyword: PBEPBE/SDD
title: #p freq=noraman PBEPBE/SDD
converged: NO NO NO NO
title: Mulliken charges:
elementType: Br Br Br O C C H H H
charge: 0.122053 0.149694 0.149685 -0.415183 -0.215411 -0.668375 0.255155 0.255150 0.367234
chargesum: 0.00000
title: Mulliken charges with hydrogens summed into heavy atoms:
elementType: Br Br Br O C C
charge: 0.122053 0.149694 0.149685 -0.047949 0.294893 -0.668375
polarizability: 8.36996226e+01 -1.85264044e-04 8.12948214e+01 -4.09280880e+00 -6.30258337e-04 5.86106278e+01
1716.lowfreq: -173.0383 -7.8499 -0.0002 0.0004 0.0004 4.3671 9.6801 111.7797 128.7201
frequency: -173.0309 111.7769 128.7201 150.8060 171.1430 204.7405 277.9219 293.3016 434.8560 567.2112 673.3951 978.7186 999.7197 1021.9975 1207.0852 1219.8502 1397.3294 1445.0852 2954.3892 3012.9300 3593.5702
redmass: 1.1160 7.7337 13.9452 13.8030 14.1566 24.8164 2.4986 10.5051 5.4011 5.2411 8.7458 7.5823 3.5231 1.6685 1.2462 1.0590 1.3513 1.0710 1.0543 1.1070 1.0668
irintensity: 152.4654 0.0343 0.3532 0.1594 3.4102 0.1735 7.1040 1.3266 24.0059 146.5105 222.6349 23.2313 76.9126 45.2962 10.0814 15.1651 1.9287 5.3480 24.3108 16.9200 17.7410
temp: 298.150 k
press: 1.00000 atm
elementType: 35 35 35 8 6 6 1 1 1
symmnumber: 1
zpe: 124678.1 jmol-1
zpe.correction: 0.047487 hartree
zpe.thermalcorrener: 0.055129 hartree
zpe.thermalcorrenthalpy: 0.056073 hartree
zpe.thermalcorrgfe: 0.012183 hartree
zpe.sumelectzpe: -193.095206 hartree
zpe.sumelectthermal: -193.087564 hartree
zpe.sumelectthermalent: -193.086620 hartree
zpe.sumelectthermalfe: -193.130510 hartree
dipole: -0.5569 -0.0004 3.2980
dipole: 3.3447
quadrupole: -65.6563 -63.1490 -51.8831
quadrupole: -0.0008 1.7809 -0.0010
quadrupole: -5.4269 -2.9195 8.3464 -0.0008 1.7809 -0.0010
hfenergy: -193.1426933 hartree
pointgroup: C01 [X(C2H3Br3O1)]
dipole: -0.6118766 0.000882 1.1650103 debye
dipolederiv: -0.5956952 -0.0002651 -0.3967135 -0.0002417 -0.1076008 -0.0001935 -0.3671075 -0.0001942 -0.3949032 -0.0529391 0.0510045 -0.0408514 0.0975756 -0.6479202 0.346587 -0.0412918 0.3410732 -0.298997 -0.052945 -0.0510348 -0.040769 -0.0976193 -0.648832 -0.3461275 -0.041161 -0.3406134 -0.298096 -0.9027411 -0.0000947 -0.1252769 -0.0001366 -0.476323 0.0002866 -0.2020033 0.0002958 -0.1131652 0.7175825 -0.0000129 0.008873 0.0000174 0.0499949 -0.0000727 0.0454648 -0.0000828 -0.0435146 0.7038116 0.0003314 0.5258862 0.0003528 1.5189626 -0.0002843 0.5696798 -0.0002836 1.0758836 -0.0271976 -0.0190478 -0.0044085 0.0366339 -0.0356858 0.1029496 -0.0481226 0.111717 -0.016269 -0.0272013 0.0190487 -0.0044319 -0.0366841 -0.0359638 -0.1029276 -0.0480803 -0.1116919 -0.0159918 0.2373251 0.0000706 0.0776922 0.000102 0.3833682 -0.0002176 0.132622 -0.0002201 0.1050532 unknown
polarizability: 70.5434903|0.0077207|81.294818|13.1810979|-0.0057405|71.7667636 unknown
InChI: InChI=1S/C2H3Br3O/c3-2(4,5)1-6/h6H,1H2
charge 0 multiplicity 1
9 atoms
Br 2.059455 0.000724 1.025442
Br 0.231476 1.643207 -1.167666
Br 0.231528 -1.644683 -1.165509
O  -2.083224 0.000243 0.303979
C  -0.817702 0.00069 1.023163
C  0.319148 0.000031 -0.013399
H  -0.69678 -0.903527 1.656673
H  -0.696769 0.90571 1.655525
H  -2.831234 0.000806 0.951192
